id_mutation,date_mutation,numero_disposition,nature_mutation,valeur_fonciere,adresse_numero,adresse_suffixe,adresse_nom_voie,adresse_code_voie,code_postal,code_commune,nom_commune,code_departement,ancien_code_commune,ancien_nom_commune,id_parcelle,ancien_id_parcelle,numero_volume,lot1_numero,lot1_surface_carrez,lot2_numero,lot2_surface_carrez,lot3_numero,lot3_surface_carrez,lot4_numero,lot4_surface_carrez,lot5_numero,lot5_surface_carrez,nombre_lots,code_type_local,type_local,surface_reelle_bati,nombre_pieces_principales,code_nature_culture,nature_culture,code_nature_culture_speciale,nature_culture_speciale,surface_terrain,longitude,latitude
2021-5171,2021-11-05,000001,Vente,1264,,,PRE DE LA MORTE,B068,01450,01331,Saint-Alban,01,,,01331000ZC0180,,,,,,,,,,,,,0,,,,,P,prés,,,7911,5.454687,46.097168
2021-5171,2021-11-05,000001,Vente,1264,,,PRE DE LA MORTE,B068,01450,01331,Saint-Alban,01,,,01331000ZC0180,,,,,,,,,,,,,0,,,,,P,prés,,,7911,5.454687,46.097168
2021-8736,2021-12-09,000001,Vente,35200,,,AU COMBET,B028,01450,01331,Saint-Alban,01,,,01331000ZA0304,,,,,,,,,,,,,0,,,,,BT,taillis simples,,,2810,5.433421,46.093883
2021-8736,2021-12-09,000001,Vente,35200,,,AU COMBET,B028,01450,01331,Saint-Alban,01,,,01331000ZA0313,,,,,,,,,,,,,0,,,,,BT,taillis simples,,,853,5.433347,46.094446
2021-8736,2021-12-09,000001,Vente,35200,,,AU BIOLAY,B004,01450,01331,Saint-Alban,01,,,01331000ZB0078,,,,,,,,,,,,,0,,,,,BT,taillis simples,,,852,5.437961,46.105702
2021-8873,2021-01-08,000001,Vente,155000,,,LE MORTARAY,B062,01450,01331,Saint-Alban,01,,,01331000AB0008,,,,,,,,,,,,,0,,,,,J,jardins,,,242,5.435584,46.095573
2021-8873,2021-01-08,000001,Vente,155000,78,,RTE DE LA ROCHETTE,0088,01450,01331,Saint-Alban,01,,,01331000AB0012,,,,,,,,,,,,,0,1,Maison,135,6,S,sols,,,440,5.436018,46.095718
2021-8873,2021-01-08,000001,Vente,155000,5097,,RTE DE LA ROCHETTE,0088,01450,01331,Saint-Alban,01,,,01331000AB0104,,,,,,,,,,,,,0,3,Dépendance,,0,S,sols,,,78,5.435828,46.095508
2021-8873,2021-01-08,000001,Vente,155000,,,LE MORTARAY,B062,01450,01331,Saint-Alban,01,,,01331000AB0105,,,,,,,,,,,,,0,,,,,L,landes,,,25,5.435922,46.095547
2021-8873,2021-01-08,000001,Vente,155000,,,LE MORTARAY,B062,01450,01331,Saint-Alban,01,,,01331000AB0137,,,,,,,,,,,,,0,,,,,P,prés,,,630,5.435775,46.095809
2021-9462,2021-02-18,000001,Vente,8000,,,SUR LAYE,B055,01450,01331,Saint-Alban,01,,,01331000ZI0217,,,,,,,,,,,,,0,,,,,P,prés,,,10422,5.447722,46.087379
2021-9462,2021-02-18,000001,Vente,8000,,,EN COMBET DODIN,B031,01450,01331,Saint-Alban,01,,,01331000ZI0305,,,,,,,,,,,,,0,,,,,P,prés,,,8190,5.446128,46.090218
2021-9462,2021-02-18,000001,Vente,8000,,,LES GALLIOTS,B050,01450,01331,Saint-Alban,01,,,01331000ZI0315,,,,,,,,,,,,,0,,,,,P,prés,,,8947,5.44273,46.085046
2021-9462,2021-02-18,000001,Vente,8000,,,LES GALLIOTS,B050,01450,01331,Saint-Alban,01,,,01331000ZI0315,,,,,,,,,,,,,0,,,,,P,prés,,,4473,5.44273,46.085046
2021-9463,2021-02-18,000001,Vente,500,,,BOCHES,B005,01450,01331,Saint-Alban,01,,,01331000ZH0035,,,,,,,,,,,,,0,,,,,L,landes,,,1574,5.44284,46.082349
2021-9463,2021-02-18,000001,Vente,500,,,SOUS BOCHES,B072,01450,01331,Saint-Alban,01,,,01331000ZH0196,,,,,,,,,,,,,0,,,,,L,landes,,,4400,5.442347,46.082335
2021-10907,2021-04-15,000002,Vente,1000,,,LE MORTARAY,B062,01450,01331,Saint-Alban,01,,,01331000AB0143,,,,,,,,,,,,,0,,,,,S,sols,,,35,5.439247,46.09597
2021-11366,2021-04-30,000001,Vente,6000,,,BOCHES,B005,01450,01331,Saint-Alban,01,,,01331000ZH0075,,,,,,,,,,,,,0,,,,,S,sols,,,71,5.443943,46.083147
2021-11366,2021-04-30,000001,Vente,6000,,,BOCHES,B005,01450,01331,Saint-Alban,01,,,01331000ZH0214,,,,,,,,,,,,,0,,,,,J,jardins,,,41,5.444121,46.083724
2021-11496,2021-05-05,000001,Vente,32000,,,CHAMAGNAT,B015,01450,01331,Saint-Alban,01,,,01331000ZI0117,,,,,,,,,,,,,0,,,,,S,sols,,,82,5.453425,46.094362
2021-11496,2021-05-05,000001,Vente,32000,,,CHAMAGNAT,B015,01450,01331,Saint-Alban,01,,,01331000ZI0118,,,,,,,,,,,,,0,,,,,J,jardins,,,311,5.453652,46.094327
2021-11601,2021-05-07,000001,Vente,30000,,,BOCHES,B005,01450,01331,Saint-Alban,01,,,01331000ZH0078,,,,,,,,,,,,,0,,,,,S,sols,,,96,5.444062,46.08317
2021-12478,2021-06-16,000001,Vente,25000,79,,RUE DES HIRONDELLES,0070,01450,01331,Saint-Alban,01,,,01331000AB0063,,,,,,,,,,,,,0,1,Maison,60,2,S,sols,,,172,5.438877,46.095626
2021-12588,2021-06-24,000001,Vente,185000,102,,CHE DU LAVOIR,0074,01450,01331,Saint-Alban,01,,,01331000ZI0456,,,,,,,,,,,,,0,1,Maison,77,3,S,sols,,,981,5.453112,46.096033
2021-12588,2021-06-24,000001,Vente,185000,102,,CHE DU LAVOIR,0074,01450,01331,Saint-Alban,01,,,01331000ZI0456,,,,,,,,,,,,,0,3,Dépendance,,0,S,sols,,,981,5.453112,46.096033
