id_mutation,date_mutation,numero_disposition,nature_mutation,valeur_fonciere,adresse_numero,adresse_suffixe,adresse_nom_voie,adresse_code_voie,code_postal,code_commune,nom_commune,code_departement,ancien_code_commune,ancien_nom_commune,id_parcelle,ancien_id_parcelle,numero_volume,lot1_numero,lot1_surface_carrez,lot2_numero,lot2_surface_carrez,lot3_numero,lot3_surface_carrez,lot4_numero,lot4_surface_carrez,lot5_numero,lot5_surface_carrez,nombre_lots,code_type_local,type_local,surface_reelle_bati,nombre_pieces_principales,code_nature_culture,nature_culture,code_nature_culture_speciale,nature_culture_speciale,surface_terrain,longitude,latitude
2021-19863,2021-03-26,000001,Echange,2200,,,LE HAUT DES USAGES BAZARD,B080,02000,02183,Chevregny,02,,,021830000C0408,,,,,,,,,,,,,0,,,,,BT,taillis simples,,,712,3.584076,49.463188
2021-19863,2021-03-26,000001,Echange,2200,,,LE HAUT DES USAGES BAZARD,B080,02000,02183,Chevregny,02,,,021830000C0465,,,,,,,,,,,,,0,,,,,BT,taillis simples,,,265,3.583433,49.461643
2021-19863,2021-03-26,000001,Echange,2200,,,LE HAUT DES USAGES BAZARD,B080,02000,02183,Chevregny,02,,,021830000C0491,,,,,,,,,,,,,0,,,,,BT,taillis simples,,,236,3.581444,49.462892
2021-19863,2021-03-26,000001,Echange,2200,,,LES HAUTES GENEVES,B085,02000,02183,Chevregny,02,,,021830000D0264,,,,,,,,,,,,,0,,,,,L,landes,,,652,3.587817,49.475714
2021-19863,2021-03-26,000001,Echange,2200,,,LES BASSES GENEVES,B017,02000,02183,Chevregny,02,,,021830000D0301,,,,,,,,,,,,,0,,,,,BT,taillis simples,,,690,3.58679,49.479111
2021-19863,2021-03-26,000001,Echange,2200,,,LES BASSES GENEVES,B017,02000,02183,Chevregny,02,,,021830000D0311,,,,,,,,,,,,,0,,,,,BT,taillis simples,,,508,3.58688,49.479384
2021-19863,2021-03-26,000001,Echange,2200,,,BOIS DES GENEVES,B028,02000,02183,Chevregny,02,,,021830000D0313,,,,,,,,,,,,,0,,,,,BT,taillis simples,,,695,3.586017,49.479873
2021-19863,2021-03-26,000001,Echange,2200,,,LES BOSSUS,B036,02000,02183,Chevregny,02,,,021830000D0404,,,,,,,,,,,,,0,,,,,L,landes,,,565,3.588231,49.474868
2021-19863,2021-03-26,000002,Echange,2200,,,LES BOUFFARDS,B037,02000,02183,Chevregny,02,,,021830000A0269,,,,,,,,,,,,,0,,,,,L,landes,,,536,3.594977,49.477102
2021-19863,2021-03-26,000002,Echange,2200,,,LES BOUFFARDS,B037,02000,02183,Chevregny,02,,,021830000A0270,,,,,,,,,,,,,0,,,,,T,terres,,,1338,3.594369,49.47676
2021-19863,2021-03-26,000002,Echange,2200,,,LES BOUFFARDS,B037,02000,02183,Chevregny,02,,,021830000A0271,,,,,,,,,,,,,0,,,,,T,terres,,,1697,3.594714,49.476711
2021-19863,2021-03-26,000002,Echange,2200,,,LES BOUFFARDS,B037,02000,02183,Chevregny,02,,,021830000A0272,,,,,,,,,,,,,0,,,,,L,landes,,,632,3.595133,49.477
2021-23415,2021-07-19,000001,Vente,88500,32,,RUE PRINCIPALE,0040,02000,02183,Chevregny,02,,,021830000D0662,,,,,,,,,,,,,0,1,Maison,216,8,S,sols,,,922,3.592156,49.472044
2021-23415,2021-07-19,000001,Vente,88500,32,,RUE PRINCIPALE,0040,02000,02183,Chevregny,02,,,021830000D0662,,,,,,,,,,,,,0,3,Dépendance,,0,S,sols,,,922,3.592156,49.472044
2021-23415,2021-07-19,000001,Vente,88500,,,AU DSU DE L ECOLE SECONDAI,B006,02000,02183,Chevregny,02,,,021830000D0663,,,,,,,,,,,,,0,,,,,J,jardins,,,1167,3.59269,49.472195
2021-24051,2021-08-04,000001,Vente,4000,,,LA FOSSE BENOITE,B074,02000,02183,Chevregny,02,,,021830000C0373,,,,,,,,,,,,,0,,,,,T,terres,,,5062,3.590501,49.465254
2021-24051,2021-08-04,000001,Vente,4000,,,LES BEHETRES,B019,02000,02183,Chevregny,02,,,02183000ZB0014,,,,,,,,,,,,,0,,,,,BT,taillis simples,,,3164,3.601453,49.481808
2021-24631,2021-08-16,000001,Vente,18000,9001,,LA RABEAUDE,B134,02000,02183,Chevregny,02,,,021830000D0616,,,,,,,,,,,,,0,3,Dépendance,,0,S,sols,,,109,3.593666,49.471952
2021-24631,2021-08-16,000001,Vente,18000,9001,,LA RABEAUDE,B134,02000,02183,Chevregny,02,,,021830000D0616,,,,,,,,,,,,,0,3,Dépendance,,0,PA,pâtures,,,928,3.593666,49.471952
2021-26943,2021-10-11,000001,Vente,2000,,,DERRIERE LA VILLE,B059,02000,02183,Chevregny,02,,,021830000D0716,,,,,,,,,,,,,0,,,,,T,terres,,,1207,3.590396,49.470948
2021-27954,2021-12-07,000001,Vente,2520,,,LE MONT DE BOSSU,B099,02000,02183,Chevregny,02,,,02183000ZB0027,,,,,,,,,,,,,0,,,,,T,terres,,,3239,3.583897,49.479192
2021-27954,2021-12-07,000001,Vente,2520,,,LE MONT DE BOSSU,B099,02000,02183,Chevregny,02,,,02183000ZB0027,,,,,,,,,,,,,0,,,,,BT,taillis simples,,,2359,3.583897,49.479192
2021-28209,2021-11-19,000001,Vente,75000,17,,RUE PRINCIPALE,0040,02000,02183,Chevregny,02,,,021830000D0894,,,,,,,,,,,,,0,1,Maison,94,4,S,sols,,,332,3.5924,49.470948
2021-28209,2021-11-19,000001,Vente,75000,17,,RUE PRINCIPALE,0040,02000,02183,Chevregny,02,,,021830000D0894,,,,,,,,,,,,,0,1,Maison,94,4,J,jardins,,,783,3.5924,49.470948
2021-28209,2021-11-19,000001,Vente,75000,17,,RUE PRINCIPALE,0040,02000,02183,Chevregny,02,,,021830000D0894,,,,,,,,,,,,,0,3,Dépendance,,0,J,jardins,,,783,3.5924,49.470948
2021-28209,2021-11-19,000001,Vente,75000,17,,RUE PRINCIPALE,0040,02000,02183,Chevregny,02,,,021830000D0894,,,,,,,,,,,,,0,3,Dépendance,,0,S,sols,,,332,3.5924,49.470948
2021-28443,2021-12-02,000001,Vente,10000,,,LA CITEE,B054,02000,02183,Chevregny,02,,,021830000D0589,,,,,,,,,,,,,0,,,,,L,landes,,,432,3.591876,49.472806
