id_mutation,date_mutation,numero_disposition,nature_mutation,valeur_fonciere,adresse_numero,adresse_suffixe,adresse_nom_voie,adresse_code_voie,code_postal,code_commune,nom_commune,code_departement,ancien_code_commune,ancien_nom_commune,id_parcelle,ancien_id_parcelle,numero_volume,lot1_numero,lot1_surface_carrez,lot2_numero,lot2_surface_carrez,lot3_numero,lot3_surface_carrez,lot4_numero,lot4_surface_carrez,lot5_numero,lot5_surface_carrez,nombre_lots,code_type_local,type_local,surface_reelle_bati,nombre_pieces_principales,code_nature_culture,nature_culture,code_nature_culture_speciale,nature_culture_speciale,surface_terrain,longitude,latitude
2021-19872,2021-04-01,000002,Vente,47000,12,,LE PETIT DORENGT,B019,02450,02269,Dorengt,02,,,022690000C0043,,,,,,,,,,,,,0,1,Maison,79,3,S,sols,,,834,3.723365,49.955347
2021-21875,2021-05-26,000001,Vente,166000,2,,RUE D ESQUEHERIES,0043,02450,02269,Dorengt,02,,,022690000A0134,,,,,,,,,,,,,0,3,Dépendance,,0,S,sols,,,750,3.689625,49.976267
2021-21875,2021-05-26,000001,Vente,166000,2,,RUE D ESQUEHERIES,0043,02450,02269,Dorengt,02,,,022690000A0134,,,,,,,,,,,,,0,1,Maison,107,4,S,sols,,,750,3.689625,49.976267
2021-21903,2021-05-31,000001,Vente,115000,,,LE VILLAGE,B031,02450,02269,Dorengt,02,,,022690000A0024,,,,,,,,,,,,,0,,,,,S,sols,,,333,3.683306,49.977114
2021-23007,2021-06-28,000001,Vente,19981,,,LE VILLAGE,B031,02450,02269,Dorengt,02,,,022690000A0007,,,,,,,,,,,,,0,,,,,PA,pâtures,,,2155,3.680346,49.97622
2021-23007,2021-06-28,000001,Vente,19981,,,LE VILLAGE,B031,02450,02269,Dorengt,02,,,022690000A0007,,,,,,,,,,,,,0,,,,,PA,pâtures,,,2155,3.680346,49.97622
2021-23007,2021-06-28,000001,Vente,19981,,,LE VILLAGE,B031,02450,02269,Dorengt,02,,,022690000A0248,,,,,,,,,,,,,0,,,,,L,landes,,,45,3.679812,49.976515
2021-23007,2021-06-28,000001,Vente,19981,,,LE RIEZ A GENETS,B025,02450,02269,Dorengt,02,,,02269000ZD0013,,,,,,,,,,,,,0,,,,,T,terres,,,5327,3.681322,49.960765
2021-23007,2021-06-28,000001,Vente,19981,,,LE RIEZ A GENETS,B025,02450,02269,Dorengt,02,,,02269000ZD0013,,,,,,,,,,,,,0,,,,,T,terres,,,2663,3.681322,49.960765
2021-28880,2021-12-17,000001,Vente,76000,1,,RUE DU MOULIN,0067,02450,02269,Dorengt,02,,,022690000A0141,,,,,,,,,,,,,0,1,Maison,84,3,S,sols,,,985,3.688294,49.975398
2021-28923,2021-12-14,000001,Vente,5000,,,LE VILLAGE,B031,02450,02269,Dorengt,02,,,022690000A0104,,,,,,,,,,,,,0,,,,,S,sols,,,1268,3.673476,49.974002
2021-28923,2021-12-14,000001,Vente,5000,,,LE VILLAGE,B031,02450,02269,Dorengt,02,,,022690000A0310,,,,,,,,,,,,,0,,,,,PA,pâtures,,,535,3.673487,49.973815
