id_mutation,date_mutation,numero_disposition,nature_mutation,valeur_fonciere,adresse_numero,adresse_suffixe,adresse_nom_voie,adresse_code_voie,code_postal,code_commune,nom_commune,code_departement,ancien_code_commune,ancien_nom_commune,id_parcelle,ancien_id_parcelle,numero_volume,lot1_numero,lot1_surface_carrez,lot2_numero,lot2_surface_carrez,lot3_numero,lot3_surface_carrez,lot4_numero,lot4_surface_carrez,lot5_numero,lot5_surface_carrez,nombre_lots,code_type_local,type_local,surface_reelle_bati,nombre_pieces_principales,code_nature_culture,nature_culture,code_nature_culture_speciale,nature_culture_speciale,surface_terrain,longitude,latitude
2021-18731,2021-03-05,000001,Vente,111000,93,,RUE CHARLES DE GAULLE,0234,02500,02381,Hirson,02,,,02381000AH0064,,,,,,,,,,,,,0,1,Maison,131,5,S,sols,,,231,4.084848,49.919651
2021-18731,2021-03-05,000001,Vente,111000,91,,RUE CHARLES DE GAULLE,0234,02500,02381,Hirson,02,,,02381000AH0208,,,,,,,,,,,,,0,,,,,S,sols,,,28,4.084857,49.919725
2021-18736,2021-02-23,000001,Vente en l'état futur d'achèvement,127271,,,RUE ALFRED BERHUY,0040,02500,02381,Hirson,02,,,02381000AI0295,,,23,,,,,,,,,,1,4,Local industriel. commercial ou assimilé,19,0,,,,,,4.084375,49.917234
2021-18741,2021-02-17,000001,Vente en l'état futur d'achèvement,139983,,,RUE ALFRED BERHUY,0040,02500,02381,Hirson,02,,,02381000AI0295,,,77,,,,,,,,,,1,4,Local industriel. commercial ou assimilé,21,0,,,,,,4.084375,49.917234
2021-18749,2021-02-12,000001,Vente en l'état futur d'achèvement,130649,,,RUE ALFRED BERHUY,0040,02500,02381,Hirson,02,,,02381000AI0295,,,22,,,,,,,,,,1,4,Local industriel. commercial ou assimilé,20,0,,,,,,4.084375,49.917234
2021-18750,2021-02-24,000001,Vente,682063,,,LA NEUVE FORGE,B107,02500,02381,Hirson,02,,,02381000BP0006,,,,,,,,,,,,,0,,,,,J,jardins,,,1130,4.120506,49.973714
2021-18750,2021-02-24,000001,Vente,682063,1,,LA NEUVE FORGE,B107,02500,02381,Hirson,02,,,02381000BP0007,,,,,,,,,,,,,0,1,Maison,120,7,S,sols,,,4660,4.120494,49.97375
2021-18750,2021-02-24,000001,Vente,682063,1,,LA NEUVE FORGE,B107,02500,02381,Hirson,02,,,02381000BP0007,,,,,,,,,,,,,0,4,Local industriel. commercial ou assimilé,254,0,S,sols,,,4660,4.120494,49.97375
2021-18750,2021-02-24,000001,Vente,682063,,,LA NEUVE FORGE,B107,02500,02381,Hirson,02,,,02381000BP0008,,,,,,,,,,,,,0,,,,,PA,pâtures,,,269,4.120866,49.973912
2021-18750,2021-02-24,000001,Vente,682063,,,LA NEUVE FORGE,B107,02500,02381,Hirson,02,,,02381000BP0014,,,,,,,,,,,,,0,,,,,T,terres,,,56078,4.11845,49.973695
2021-18750,2021-02-24,000001,Vente,682063,,,LA NEUVE FORGE,B107,02500,02381,Hirson,02,,,02381000BP0014,,,,,,,,,,,,,0,,,,,PA,pâtures,,,23754,4.11845,49.973695
2021-18750,2021-02-24,000001,Vente,682063,,,LA NEUVE FORGE,B107,02500,02381,Hirson,02,,,02381000BP0016,,,,,,,,,,,,,0,,,,,BT,taillis simples,,,8202,4.118283,49.970779
2021-18750,2021-02-24,000001,Vente,682063,,,LA NEUVE FORGE,B107,02500,02381,Hirson,02,,,02381000BP0019,,,,,,,,,,,,,0,,,,,BT,taillis simples,,,5180,4.117025,49.974826
2021-18750,2021-02-24,000001,Vente,682063,,,LA NEUVE FORGE,B107,02500,02381,Hirson,02,,,02381000BP0033,,,,,,,,,,,,,0,,,,,BT,taillis simples,,,5020,4.116123,49.975304
2021-18752,2021-02-24,000001,Vente en l'état futur d'achèvement,147897,,,RUE ALFRED BERHUY,0040,02500,02381,Hirson,02,,,02381000AI0295,,,76,,,,,,,,,,1,4,Local industriel. commercial ou assimilé,22,0,,,,,,4.084375,49.917234
2021-18757,2021-02-23,000001,Vente en l'état futur d'achèvement,152446,,,RUE ALFRED BERHUY,0040,02500,02381,Hirson,02,,,02381000AI0295,,,87,,,,,,,,,,1,4,Local industriel. commercial ou assimilé,23,0,,,,,,4.084375,49.917234
2021-18830,2021-02-23,000001,Vente,15000,9,,PL BRISSET,0120,02500,02381,Hirson,02,,,02381000AB0150,,,,,,,,,,,,,0,1,Maison,74,5,S,sols,,,58,4.07703,49.925962
2021-18830,2021-02-23,000001,Vente,15000,,,PL BRISSET,0120,02500,02381,Hirson,02,,,02381000AB0274,,,,,,,,,,,,,0,,,,,S,sols,,,77,4.076875,49.926039
2021-18911,2021-02-24,000001,Vente,1104000,125,,RUE DE GUISE,0440,02500,02381,Hirson,02,,,02381000BE0267,,,,,,,,,,,,,0,,,,,PA,pâtures,,,8845,4.067129,49.921232
2021-18911,2021-02-24,000001,Vente,1104000,125,,RUE DE GUISE,0440,02500,02381,Hirson,02,,,02381000BE0267,,,,,,,,,,,,,0,,,,,S,sols,,,15399,4.067129,49.921232
2021-19114,2021-03-08,000001,Vente,80500,119,,RUE D ALSACE,0050,02500,02381,Hirson,02,,,02381000AI0121,,,,,,,,,,,,,0,2,Appartement,27,1,S,sols,,,56,4.083854,49.915011
2021-19114,2021-03-08,000001,Vente,80500,119,,RUE D ALSACE,0050,02500,02381,Hirson,02,,,02381000AI0121,,,,,,,,,,,,,0,2,Appartement,35,3,S,sols,,,56,4.083854,49.915011
2021-19114,2021-03-08,000001,Vente,80500,119,,RUE D ALSACE,0050,02500,02381,Hirson,02,,,02381000AI0121,,,,,,,,,,,,,0,1,Maison,45,2,S,sols,,,56,4.083854,49.915011
2021-19119,2021-03-03,000001,Vente,11000,2,,RUE ALEXANDRE DUMAS,0030,02500,02381,Hirson,02,,,02381000AB0101,,,,,,,,,,,,,0,1,Maison,40,3,S,sols,,,28,4.077484,49.925218
2021-19129,2021-02-26,000001,Vente,45000,13,E,RUE DE LA LIBERTE,0630,02500,02381,Hirson,02,,,02381000AE0379,,,,,,,,,,,,,0,3,Dépendance,,0,S,sols,,,17,4.085636,49.922033
2021-19129,2021-02-26,000001,Vente,45000,13,,RUE DE LA LIBERTE,0630,02500,02381,Hirson,02,,,02381000AE0380,,,,,,,,,,,,,0,,,,,S,sols,,,90,4.085558,49.921985
2021-19129,2021-02-26,000001,Vente,45000,46,,RUE DE LA REPUBLIQUE,0900,02500,02381,Hirson,02,,,02381000AH0039,,,,,,,,,,,,,0,1,Maison,78,4,S,sols,,,163,4.0851,49.920867
2021-19169,2021-03-18,000001,Vente,45000,4,,RUE MAGNIER,0670,02500,02381,Hirson,02,,,02381000AM0353,,,,,,,,,,,,,0,,,,,S,sols,,,43,4.074122,49.923792
2021-19169,2021-03-18,000001,Vente,45000,2,B,RUE MAGNIER,0670,02500,02381,Hirson,02,,,02381000AM0355,,,,,,,,,,,,,0,1,Maison,73,3,S,sols,,,114,4.074074,49.923766
2021-19170,2021-03-04,000001,Vente,100000,,,LE PLAIN,B066,02500,02381,Hirson,02,,,02381000AR0120,,,,,,,,,,,,,0,,,,,PA,pâtures,,,1029,4.087745,49.926349
2021-19170,2021-03-04,000001,Vente,100000,34,,RUE JULES LORIETTE,0590,02500,02381,Hirson,02,,,02381000AR0122,,,,,,,,,,,,,0,1,Maison,92,3,J,jardins,,,971,4.087556,49.925913
2021-19170,2021-03-04,000001,Vente,100000,34,,RUE JULES LORIETTE,0590,02500,02381,Hirson,02,,,02381000AR0122,,,,,,,,,,,,,0,1,Maison,92,3,S,sols,,,690,4.087556,49.925913
2021-19252,2021-03-08,000001,Vente,12500,65,,RUE GEORGES CLEMENCEAU,0410,02500,02381,Hirson,02,,,02381000AK0143,,,,,,,,,,,,,0,1,Maison,96,5,J,jardins,,,167,4.081662,49.919058
2021-19252,2021-03-08,000001,Vente,12500,65,,RUE GEORGES CLEMENCEAU,0410,02500,02381,Hirson,02,,,02381000AK0143,,,,,,,,,,,,,0,1,Maison,96,5,S,sols,,,114,4.081662,49.919058
2021-19252,2021-03-08,000001,Vente,12500,92,,RUE GEORGES CLEMENCEAU,0410,02500,02381,Hirson,02,,,02381000AL0356,,,,,,,,,,,,,0,,,,,AB,terrains a bâtir,,,571,4.081086,49.918964
2021-19337,2021-03-10,000001,Vente,8000,4,,PL BRISSET,0120,02500,02381,Hirson,02,,,02381000AB0279,,,,,,,,,,,,,0,1,Maison,78,3,S,sols,,,60,4.07685,49.925748
2021-19374,2021-03-19,000001,Vente,30000,1,,PL BRISSET,0120,02500,02381,Hirson,02,,,02381000AB0146,,,,,,,,,,,,,0,1,Maison,90,3,S,sols,,,72,4.076655,49.92589
2021-19375,2021-03-22,000001,Vente,26000,35,,RUE DU BAS ROUET,0100,02500,02381,Hirson,02,,,02381000AP0205,,,,,,,,,,,,,0,1,Maison,60,3,S,sols,,,100,4.078368,49.928466
2021-19393,2021-03-18,000001,Vente,52000,9,,RUE JOLY,0560,02500,02381,Hirson,02,,,02381000AL0237,,,,,,,,,,,,,0,1,Maison,50,3,S,sols,,,236,4.081372,49.916166
2021-19393,2021-03-18,000001,Vente,52000,6,T,RUE JOLY,0560,02500,02381,Hirson,02,,,02381000AL0385,,,,,,,,,,,,,0,3,Dépendance,,0,S,sols,,,37,4.081442,49.916455
2021-19396,2021-03-04,000001,Vente,80000,12,,AV FRANCOIS MITTERRAND,0369,02500,02381,Hirson,02,,,02381000AI0366,,,,,,,,,,,,,0,4,Local industriel. commercial ou assimilé,94,0,S,sols,,,99,4.085651,49.916123
2021-19396,2021-03-04,000001,Vente,80000,12,,AV FRANCOIS MITTERRAND,0369,02500,02381,Hirson,02,,,02381000AI0366,,,,,,,,,,,,,0,2,Appartement,80,3,S,sols,,,99,4.085651,49.916123
2021-19396,2021-03-04,000001,Vente,80000,12,,AV FRANCOIS MITTERRAND,0369,02500,02381,Hirson,02,,,02381000AI0366,,,,,,,,,,,,,0,2,Appartement,47,2,S,sols,,,99,4.085651,49.916123
2021-19452,2021-03-04,000001,Vente,45000,2,B,AV FRANCOIS MITTERRAND,0369,02500,02381,Hirson,02,,,02381000AI0474,,,,,,,,,,,,,0,,,,,S,sols,,,21,4.086043,49.916374
2021-19452,2021-03-04,000001,Vente,45000,,,,,,02381,Hirson,02,,,02381000AI0475,,3,,,,,,,,,,,0,,,,,,,,,,4.086077,49.916353
2021-19452,2021-03-04,000001,Vente,45000,,,,,,02381,Hirson,02,,,02381000AI0475,,4,,,,,,,,,,,0,,,,,,,,,,4.086077,49.916353
2021-19452,2021-03-04,000001,Vente,45000,2,T,AV FRANCOIS MITTERRAND,0369,02500,02381,Hirson,02,,,02381000AI0478,,,,,,,,,,,,,0,,,,,S,sols,,,27,4.085986,49.916363
2021-19456,2021-03-24,000001,Vente,80000,8,,VC CH ROLAND CALMETTE GUERIN,0205,02500,02381,Hirson,02,,,02381000AN0210,,,,,,,,,,,,,0,1,Maison,90,6,S,sols,,,427,4.073066,49.927015
2021-19462,2021-03-29,000001,Vente,56435,20,,RUE DE SAINT MICHEL,0950,02500,02381,Hirson,02,,,02381000AE0354,,,,,,,,,,,,,0,2,Appartement,17,1,S,sols,,,194,4.087272,49.921437
2021-19462,2021-03-29,000001,Vente,56435,20,,RUE DE SAINT MICHEL,0950,02500,02381,Hirson,02,,,02381000AE0354,,,,,,,,,,,,,0,3,Dépendance,,0,S,sols,,,194,4.087272,49.921437
2021-19462,2021-03-29,000001,Vente,56435,20,,RUE DE SAINT MICHEL,0950,02500,02381,Hirson,02,,,02381000AE0354,,,,,,,,,,,,,0,3,Dépendance,,0,S,sols,,,194,4.087272,49.921437
2021-19462,2021-03-29,000001,Vente,56435,20,,RUE DE SAINT MICHEL,0950,02500,02381,Hirson,02,,,02381000AE0354,,,,,,,,,,,,,0,2,Appartement,19,1,S,sols,,,194,4.087272,49.921437
2021-19462,2021-03-29,000001,Vente,56435,20,,RUE DE SAINT MICHEL,0950,02500,02381,Hirson,02,,,02381000AE0354,,,,,,,,,,,,,0,2,Appartement,10,1,S,sols,,,194,4.087272,49.921437
2021-19462,2021-03-29,000001,Vente,56435,20,,RUE DE SAINT MICHEL,0950,02500,02381,Hirson,02,,,02381000AE0354,,,,,,,,,,,,,0,2,Appartement,20,1,S,sols,,,194,4.087272,49.921437
2021-19462,2021-03-29,000001,Vente,56435,20,,RUE DE SAINT MICHEL,0950,02500,02381,Hirson,02,,,02381000AE0354,,,,,,,,,,,,,0,2,Appartement,25,1,S,sols,,,194,4.087272,49.921437
2021-19503,2021-03-31,000001,Vente,52000,32,,RUE DE LA REPUBLIQUE,0900,02500,02381,Hirson,02,,,02381000AH0005,,,,,,,,,,,,,0,1,Maison,82,4,S,sols,,,107,4.085035,49.921301
2021-19761,2021-03-22,000001,Vente en l'état futur d'achèvement,134649,,,RUE ALFRED BERHUY,0040,02500,02381,Hirson,02,,,02381000AI0295,,,65,,,,,,,,,,1,4,Local industriel. commercial ou assimilé,20,0,,,,,,4.084375,49.917234
2021-19763,2021-03-25,000001,Vente en l'état futur d'achèvement,134649,,,RUE ALFRED BERHUY,0040,02500,02381,Hirson,02,,,02381000AI0295,,,28,,,,,,,,,,1,4,Local industriel. commercial ou assimilé,20,0,,,,,,4.084375,49.917234
2021-19819,2021-03-24,000001,Vente en l'état futur d'achèvement,134649,,,RUE ALFRED BERHUY,0040,02500,02381,Hirson,02,,,02381000AI0295,,,38,,,,,,,,,,1,4,Local industriel. commercial ou assimilé,20,0,,,,,,4.084375,49.917234
2021-19862,2021-03-22,000001,Vente,26000,,,LE TAILLIS,B118,02500,02381,Hirson,02,,,02381000BY0292,,,,,,,,,,,,,0,,,,,AB,terrains a bâtir,,,157,4.098271,49.925162
2021-19862,2021-03-22,000001,Vente,26000,,,LE TAILLIS,B118,02500,02381,Hirson,02,,,02381000BY0293,,,,,,,,,,,,,0,,,,,AB,terrains a bâtir,,,170,4.098059,49.925217
2021-19862,2021-03-22,000001,Vente,26000,,,LE TAILLIS,B118,02500,02381,Hirson,02,,,02381000BY0294,,,,,,,,,,,,,0,,,,,AB,terrains a bâtir,,,205,4.097824,49.925308
2021-19862,2021-03-22,000001,Vente,26000,,,LE GRAND TAILLIS SUD,B103,02500,02381,Hirson,02,,,02381000ZA0059,,,,,,,,,,,,,0,,,,,AB,terrains a bâtir,,,340,4.098398,49.925269
2021-19862,2021-03-22,000001,Vente,26000,,,LE GRAND TAILLIS SUD,B103,02500,02381,Hirson,02,,,02381000ZA0060,,,,,,,,,,,,,0,,,,,AB,terrains a bâtir,,,349,4.098218,49.925355
2021-19862,2021-03-22,000001,Vente,26000,,,LE GRAND TAILLIS SUD,B103,02500,02381,Hirson,02,,,02381000ZA0061,,,,,,,,,,,,,0,,,,,AB,terrains a bâtir,,,341,4.097967,49.925442
2021-19862,2021-03-22,000001,Vente,26000,,,LE GRAND TAILLIS SUD,B103,02500,02381,Hirson,02,,,02381000ZA0063,,,,,,,,,,,,,0,,,,,AB,terrains a bâtir,,,590,4.097704,49.925647
2021-19893,2021-03-22,000001,Vente,8500,,,LE GRAND TAILLIS SUD,B103,02500,02381,Hirson,02,,,02381000ZA0066,,,,,,,,,,,,,0,,,,,AB,terrains a bâtir,,,658,4.098252,49.926071
2021-19904,2021-03-23,000001,Vente en l'état futur d'achèvement,107201.66,,,RUE ALFRED BERHUY,0040,02500,02381,Hirson,02,,,02381000AI0295,,,36,,,,,,,,,,1,4,Local industriel. commercial ou assimilé,20,0,,,,,,4.084375,49.917234
2021-19914,2021-03-22,000001,Vente,8500,,,LE GRAND TAILLIS SUD,B103,02500,02381,Hirson,02,,,02381000ZA0067,,,,,,,,,,,,,0,,,,,AB,terrains a bâtir,,,503,4.098235,49.925939
2021-19916,2021-03-22,000001,Vente,9000,,,LE GRAND TAILLIS SUD,B103,02500,02381,Hirson,02,,,02381000ZA0069,,,,,,,,,,,,,0,,,,,AB,terrains a bâtir,,,547,4.098321,49.925628
2021-19919,2021-03-22,000001,Vente,9000,,,LE GRAND TAILLIS SUD,B103,02500,02381,Hirson,02,,,02381000ZA0068,,,,,,,,,,,,,0,,,,,AB,terrains a bâtir,,,502,4.098311,49.925801
2021-19986,2021-03-23,000001,Vente,686400,127,,RUE CHARLES DE GAULLE,0234,02500,02381,Hirson,02,,,02381000AV0609,,,,,,,,,,,,,0,4,Local industriel. commercial ou assimilé,85,0,S,sols,,,720,4.086098,49.917739
2021-19986,2021-03-23,000001,Vente,686400,127,,RUE CHARLES DE GAULLE,0234,02500,02381,Hirson,02,,,02381000AV0609,,,,,,,,,,,,,0,4,Local industriel. commercial ou assimilé,75,0,S,sols,,,720,4.086098,49.917739
2021-19986,2021-03-23,000001,Vente,686400,127,,RUE CHARLES DE GAULLE,0234,02500,02381,Hirson,02,,,02381000AV0609,,,,,,,,,,,,,0,4,Local industriel. commercial ou assimilé,50,0,S,sols,,,720,4.086098,49.917739
2021-19986,2021-03-23,000001,Vente,686400,127,,RUE CHARLES DE GAULLE,0234,02500,02381,Hirson,02,,,02381000AV0609,,,,,,,,,,,,,0,4,Local industriel. commercial ou assimilé,52,0,S,sols,,,720,4.086098,49.917739
2021-19986,2021-03-23,000001,Vente,686400,127,,RUE CHARLES DE GAULLE,0234,02500,02381,Hirson,02,,,02381000AV0609,,,,,,,,,,,,,0,4,Local industriel. commercial ou assimilé,52,0,S,sols,,,720,4.086098,49.917739
2021-19986,2021-03-23,000001,Vente,686400,127,,RUE CHARLES DE GAULLE,0234,02500,02381,Hirson,02,,,02381000AV0609,,,,,,,,,,,,,0,4,Local industriel. commercial ou assimilé,38,0,S,sols,,,720,4.086098,49.917739
2021-19986,2021-03-23,000001,Vente,686400,127,,RUE CHARLES DE GAULLE,0234,02500,02381,Hirson,02,,,02381000AV0609,,,,,,,,,,,,,0,4,Local industriel. commercial ou assimilé,52,0,S,sols,,,720,4.086098,49.917739
2021-19986,2021-03-23,000001,Vente,686400,127,,RUE CHARLES DE GAULLE,0234,02500,02381,Hirson,02,,,02381000AV0609,,,,,,,,,,,,,0,4,Local industriel. commercial ou assimilé,52,0,S,sols,,,720,4.086098,49.917739
2021-19986,2021-03-23,000001,Vente,686400,127,,RUE CHARLES DE GAULLE,0234,02500,02381,Hirson,02,,,02381000AV0609,,,,,,,,,,,,,0,4,Local industriel. commercial ou assimilé,38,0,S,sols,,,720,4.086098,49.917739
2021-19986,2021-03-23,000001,Vente,686400,127,,RUE CHARLES DE GAULLE,0234,02500,02381,Hirson,02,,,02381000AV0609,,,,,,,,,,,,,0,4,Local industriel. commercial ou assimilé,52,0,S,sols,,,720,4.086098,49.917739
2021-19986,2021-03-23,000001,Vente,686400,127,,RUE CHARLES DE GAULLE,0234,02500,02381,Hirson,02,,,02381000AV0609,,,,,,,,,,,,,0,4,Local industriel. commercial ou assimilé,52,0,S,sols,,,720,4.086098,49.917739
2021-19986,2021-03-23,000001,Vente,686400,127,,RUE CHARLES DE GAULLE,0234,02500,02381,Hirson,02,,,02381000AV0609,,,,,,,,,,,,,0,4,Local industriel. commercial ou assimilé,38,0,S,sols,,,720,4.086098,49.917739
2021-19988,2021-03-17,000001,Vente,27000,68,,RUE DU GENERAL DEBENEY,0390,02500,02381,Hirson,02,,,02381000BE0072,,,,,,,,,,,,,0,1,Maison,84,3,S,sols,,,633,4.076849,49.915927
2021-19988,2021-03-17,000001,Vente,27000,70,,RUE DU GENERAL DEBENEY,0390,02500,02381,Hirson,02,,,02381000BE0073,,,,,,,,,,,,,0,1,Maison,60,3,S,sols,,,499,4.07662,49.915978
2021-19999,2021-04-16,000001,Vente,8800,92,,AV FRANCOIS MITTERRAND,0369,02500,02381,Hirson,02,,,02381000AL0430,,,,,,,,,,,,,0,,,,,S,sols,,,34,4.083654,49.914562
2021-19999,2021-04-16,000001,Vente,8800,92,,AV FRANCOIS MITTERRAND,0369,02500,02381,Hirson,02,,,02381000AL0431,,,,,,,,,,,,,0,,,,,S,sols,,,258,4.083552,49.914665
2021-20000,2021-04-16,000001,Vente,1500,,,LE CAILLOU,B008,02500,02381,Hirson,02,,,02381000AM0299,,,,,,,,,,,,,0,,,,,J,jardins,,,600,4.074342,49.922147
2021-20002,2021-04-16,000001,Vente,8000,80,,AV DU MARECHAL JOFFRE,0690,02500,02381,Hirson,02,,,02381000AN0308,,,,,,,,,,,,,0,,,,,S,sols,,,5,4.074769,49.93025
2021-20002,2021-04-16,000001,Vente,8000,80,,AV DU MARECHAL JOFFRE,0690,02500,02381,Hirson,02,,,02381000AN0309,,,,,,,,,,,,,0,4,Local industriel. commercial ou assimilé,75,0,S,sols,,,131,4.074574,49.930213
2021-20002,2021-04-16,000001,Vente,8000,82,,AV DU MARECHAL JOFFRE,0690,02500,02381,Hirson,02,,,02381000AN0310,,,,,,,,,,,,,0,,,,,S,sols,,,12,4.074707,49.93031
2021-20002,2021-04-16,000001,Vente,8000,82,,AV DU MARECHAL JOFFRE,0690,02500,02381,Hirson,02,,,02381000AN0311,,,,,,,,,,,,,0,1,Maison,90,4,S,sols,,,191,4.074542,49.93026
2021-20045,2021-04-02,000001,Vente en l'état futur d'achèvement,131471,,,RUE ALFRED BERHUY,0040,02500,02381,Hirson,02,,,02381000AI0295,,,10,,,,,,,,,,1,4,Local industriel. commercial ou assimilé,19,0,,,,,,4.084375,49.917234
2021-20087,2021-04-20,000001,Vente,32130,102,,RUE DE LA REPUBLIQUE,0900,02500,02381,Hirson,02,,,02381000AH0212,,,,,,,,,,,,,0,1,Maison,56,2,S,sols,,,56,4.085393,49.918774
2021-20160,2021-04-02,000001,Vente en l'état futur d'achèvement,137827,,,RUE ALFRED BERHUY,0040,02500,02381,Hirson,02,,,02381000AI0295,,,63,20.9,,,,,,,,,1,4,Local industriel. commercial ou assimilé,20,0,,,,,,4.084375,49.917234
2021-20161,2021-03-31,000001,Vente en l'état futur d'achèvement,266120,,,RUE ALFRED BERHUY,0040,02500,02381,Hirson,02,,,02381000AI0295,,,50,,,,,,,,,,1,4,Local industriel. commercial ou assimilé,19,0,,,,,,4.084375,49.917234
2021-20161,2021-03-31,000001,Vente en l'état futur d'achèvement,266120,,,RUE ALFRED BERHUY,0040,02500,02381,Hirson,02,,,02381000AI0295,,,56,,,,,,,,,,1,4,Local industriel. commercial ou assimilé,20,0,,,,,,4.084375,49.917234
2021-20191,2021-04-23,000001,Vente,65000,6,B,PL ROUSSEAU,0940,02500,02381,Hirson,02,,,02381000AD0027,,,,,,,,,,,,,0,1,Maison,69,4,S,sols,,,408,4.085012,49.923077
2021-20317,2021-04-15,000001,Vente,42000,23,,AV DES CHAMPS ELYSEES,0195,02500,02381,Hirson,02,,,02381000AW0245,,,,,,,,,,,,,0,1,Maison,111,5,S,sols,,,210,4.087811,49.914824
2021-20317,2021-04-15,000001,Vente,42000,23,,AV DES CHAMPS ELYSEES,0195,02500,02381,Hirson,02,,,02381000AW0245,,,,,,,,,,,,,0,1,Maison,111,5,J,jardins,,,293,4.087811,49.914824
2021-20317,2021-04-15,000001,Vente,42000,23,B,AV DES CHAMPS ELYSEES,0195,02500,02381,Hirson,02,,,02381000AW0820,,,,,,,,,,,,,0,,,,,S,sols,,,2,4.087754,49.914739
2021-20320,2021-04-15,000001,Vente,65000,26,,RUE DE SAINT MICHEL,0950,02500,02381,Hirson,02,,,02381000AE0269,,,,,,,,,,,,,0,1,Maison,64,3,S,sols,,,353,,
2021-20320,2021-04-15,000001,Vente,65000,26,,RUE DE SAINT MICHEL,0950,02500,02381,Hirson,02,,,02381000AE0269,,,,,,,,,,,,,0,1,Maison,106,4,S,sols,,,353,,
2021-20444,2021-04-15,000001,Vente en l'état futur d'achèvement,147361,,,RUE ALFRED BERHUY,0040,02500,02381,Hirson,02,,,02381000AI0295,,,85,,,,,,,,,,1,4,Local industriel. commercial ou assimilé,22,0,,,,,,4.084375,49.917234
2021-20446,2021-04-16,000001,Vente en l'état futur d'achèvement,132106,,,RUE ALFRED BERHUY,0040,02500,02381,Hirson,02,,,02381000AI0295,,,43,,,,,,,,,,1,4,Local industriel. commercial ou assimilé,20,0,,,,,,4.084375,49.917234
2021-20452,2021-04-14,000001,Vente en l'état futur d'achèvement,264712,,,RUE ALFRED BERHUY,0040,02500,02381,Hirson,02,,,02381000AI0295,,,33,,,,,,,,,,1,4,Local industriel. commercial ou assimilé,20,0,,,,,,4.084375,49.917234
2021-20452,2021-04-14,000001,Vente en l'état futur d'achèvement,264712,,,RUE ALFRED BERHUY,0040,02500,02381,Hirson,02,,,02381000AI0295,,,61,,,,,,,,,,1,4,Local industriel. commercial ou assimilé,20,0,,,,,,4.084375,49.917234
2021-20454,2021-04-15,000001,Vente en l'état futur d'achèvement,145454,,,RUE ALFRED BERHUY,0040,02500,02381,Hirson,02,,,02381000AI0295,,,69,22.1,,,,,,,,,1,4,Local industriel. commercial ou assimilé,22,0,,,,,,4.084375,49.917234
2021-20477,2021-04-23,000001,Vente en l'état futur d'achèvement,132106,,,RUE ALFRED BERHUY,0040,02500,02381,Hirson,02,,,02381000AI0295,,,44,,,,,,,,,,1,4,Local industriel. commercial ou assimilé,20,0,,,,,,4.084375,49.917234
2021-20479,2021-04-16,000001,Vente en l'état futur d'achèvement,152446,,,RUE ALFRED BERHUY,0040,02500,02381,Hirson,02,,,02381000AI0295,,,74,,,,,,,,,,1,4,Local industriel. commercial ou assimilé,23,0,,,,,,4.084375,49.917234
2021-20545,2021-05-04,000001,Vente,67000,21,,CITE DU PLAIN P DEVOUGE,0816,02500,02381,Hirson,02,,,02381000AR0104,,,,,,,,,,,,,0,1,Maison,66,4,S,sols,,,222,4.086546,49.926204
2021-20545,2021-05-04,000001,Vente,67000,16,,CITE DU PLAIN IMP R PANE,0815,02500,02381,Hirson,02,,,02381000AR0479,,,,,,,,,,,,,0,3,Dépendance,,0,S,sols,,,16,4.087674,49.926466
2021-20723,2021-04-26,000001,Vente,131000,47,,RUE DU HAUT ROUET,0480,02500,02381,Hirson,02,,,02381000AP0440,,,,,,,,,,,,,0,1,Maison,94,3,S,sols,,,715,4.083234,49.932367
2021-20748,2021-04-29,000001,Vente,88050,113,,RUE DE LA VERRERIE,1011,02500,02381,Hirson,02,,,02381000AX0022,,,,,,,,,,,,,0,1,Maison,135,6,J,jardins,,,448,4.093653,49.912697
2021-20748,2021-04-29,000001,Vente,88050,113,,RUE DE LA VERRERIE,1011,02500,02381,Hirson,02,,,02381000AX0022,,,,,,,,,,,,,0,1,Maison,52,1,J,jardins,,,448,4.093653,49.912697
2021-20748,2021-04-29,000001,Vente,88050,113,,RUE DE LA VERRERIE,1011,02500,02381,Hirson,02,,,02381000AX0022,,,,,,,,,,,,,0,1,Maison,52,1,PA,pâtures,,,1624,4.093653,49.912697
2021-20748,2021-04-29,000001,Vente,88050,113,,RUE DE LA VERRERIE,1011,02500,02381,Hirson,02,,,02381000AX0022,,,,,,,,,,,,,0,1,Maison,135,6,S,sols,,,621,4.093653,49.912697
2021-20748,2021-04-29,000001,Vente,88050,113,,RUE DE LA VERRERIE,1011,02500,02381,Hirson,02,,,02381000AX0022,,,,,,,,,,,,,0,1,Maison,135,6,PA,pâtures,,,1624,4.093653,49.912697
2021-20748,2021-04-29,000001,Vente,88050,113,,RUE DE LA VERRERIE,1011,02500,02381,Hirson,02,,,02381000AX0022,,,,,,,,,,,,,0,1,Maison,52,1,S,sols,,,621,4.093653,49.912697
2021-20776,2021-05-03,000001,Vente,27000,73,,RUE DU PLAIN,0811,02500,02381,Hirson,02,,,02381000AR0126,,,,,,,,,,,,,0,1,Maison,79,3,S,sols,,,530,4.087365,49.925542
2021-20824,2021-04-30,000001,Vente en l'état futur d'achèvement,131084,,,RUE ALFRED BERHUY,0040,02500,02381,Hirson,02,,,02381000AI0295,,,58,,,,,,,,,,1,4,Local industriel. commercial ou assimilé,20,0,,,,,,4.084375,49.917234
2021-20854,2021-05-11,000001,Vente,100000,10,,AV DU MARECHAL JOFFRE,0690,02500,02381,Hirson,02,,,02381000AN0099,,,,,,,,,,,,,0,1,Maison,175,6,S,sols,,,706,4.075912,49.927223
2021-20916,2021-05-18,000001,Vente,4200,,,L ENCLOS GENARD,B020,02500,02381,Hirson,02,,,02381000ZB0092,,,,,,,,,,,,,0,,,,,PA,pâtures,,,5996,4.100992,49.915619
2021-20916,2021-05-18,000001,Vente,4200,,,L ENCLOS GENARD,B020,02500,02381,Hirson,02,,,02381000ZB0092,,,,,,,,,,,,,0,,,,,PA,pâtures,,,5996,4.100992,49.915619
2021-20990,2021-05-20,000001,Vente,71000,35,,RUE DE VERVINS,1030,02500,02381,Hirson,02,,,02381000AH0222,,,,,,,,,,,,,0,1,Maison,103,5,S,sols,,,181,4.082836,49.920512
2021-20990,2021-05-20,000001,Vente,71000,35,,RUE DE VERVINS,1030,02500,02381,Hirson,02,,,02381000AH0222,,,,,,,,,,,,,0,1,Maison,103,5,J,jardins,,,84,4.082836,49.920512
2021-21056,2021-04-23,000001,Vente,95000,94,,CITE CHA ELYSEES STRASBOURG,0203,02500,02381,Hirson,02,,,02381000AW0104,,,,,,,,,,,,,0,,,,,S,sols,,,391,4.083982,49.911369
2021-21056,2021-04-23,000001,Vente,95000,94,,CITE CHA ELYSEES STRASBOURG,0203,02500,02381,Hirson,02,,,02381000AW0104,,,,,,,,,,,,,0,,,,,J,jardins,,,423,4.083982,49.911369
2021-21056,2021-04-23,000001,Vente,95000,92,,CITE CHA ELYSEES STRASBOURG,0203,02500,02381,Hirson,02,,,02381000AW0105,,,,,,,,,,,,,0,,,,,S,sols,,,38,4.084044,49.911246
2021-21056,2021-04-23,000001,Vente,95000,90,,CITE CHA ELYSEES STRASBOURG,0203,02500,02381,Hirson,02,,,02381000AW0106,,,,,,,,,,,,,0,1,Maison,159,6,J,jardins,,,217,4.084134,49.911401