id_mutation,date_mutation,numero_disposition,nature_mutation,valeur_fonciere,adresse_numero,adresse_suffixe,adresse_nom_voie,adresse_code_voie,code_postal,code_commune,nom_commune,code_departement,ancien_code_commune,ancien_nom_commune,id_parcelle,ancien_id_parcelle,numero_volume,lot1_numero,lot1_surface_carrez,lot2_numero,lot2_surface_carrez,lot3_numero,lot3_surface_carrez,lot4_numero,lot4_surface_carrez,lot5_numero,lot5_surface_carrez,nombre_lots,code_type_local,type_local,surface_reelle_bati,nombre_pieces_principales,code_nature_culture,nature_culture,code_nature_culture_speciale,nature_culture_speciale,surface_terrain,longitude,latitude
2021-18417,2021-02-04,000001,Vente,9000,,,LE VILLAGE,B050,02250,02513,Montigny-le-Franc,02,,,025130000A0492,,,,,,,,,,,,,0,,,,,S,sols,,,2608,3.906951,49.688553
2021-18417,2021-02-04,000001,Vente,9000,,,LE VILLAGE,B050,02250,02513,Montigny-le-Franc,02,,,025130000A0495,,,,,,,,,,,,,0,,,,,J,jardins,,,1633,3.906481,49.688442
2021-18417,2021-02-04,000001,Vente,9000,2,,RUE DU  PRESBYTERE,0060,02250,02513,Montigny-le-Franc,02,,,025130000A0808,,,,,,,,,,,,,0,,,,,S,sols,,,764,,
2021-20681,2021-04-21,000001,Vente,72000,22,,RUE DES MANANTS,0047,02250,02513,Montigny-le-Franc,02,,,025130000A0506,,,,,,,,,,,,,0,1,Maison,80,3,S,sols,,,431,3.905122,49.688952
2021-20681,2021-04-21,000001,Vente,72000,22,,RUE DES MANANTS,0047,02250,02513,Montigny-le-Franc,02,,,025130000A0507,,,,,,,,,,,,,0,,,,,S,sols,,,569,3.905025,49.68905
2021-24506,2021-07-30,000001,Vente,174000,23,,RUE DES MANANTS,0047,02250,02513,Montigny-le-Franc,02,,,025130000A0815,,,,,,,,,,,,,0,3,Dépendance,,0,S,sols,,,561,3.908113,49.689834
2021-24506,2021-07-30,000001,Vente,174000,23,,RUE DES MANANTS,0047,02250,02513,Montigny-le-Franc,02,,,025130000A0815,,,,,,,,,,,,,0,1,Maison,208,7,J,jardins,,,1592,3.908113,49.689834
2021-24506,2021-07-30,000001,Vente,174000,23,,RUE DES MANANTS,0047,02250,02513,Montigny-le-Franc,02,,,025130000A0815,,,,,,,,,,,,,0,3,Dépendance,,0,J,jardins,,,1592,3.908113,49.689834
2021-24506,2021-07-30,000001,Vente,174000,23,,RUE DES MANANTS,0047,02250,02513,Montigny-le-Franc,02,,,025130000A0815,,,,,,,,,,,,,0,3,Dépendance,,0,J,jardins,,,1592,3.908113,49.689834
2021-24506,2021-07-30,000001,Vente,174000,23,,RUE DES MANANTS,0047,02250,02513,Montigny-le-Franc,02,,,025130000A0815,,,,,,,,,,,,,0,3,Dépendance,,0,J,jardins,,,1592,3.908113,49.689834
2021-24506,2021-07-30,000001,Vente,174000,23,,RUE DES MANANTS,0047,02250,02513,Montigny-le-Franc,02,,,025130000A0815,,,,,,,,,,,,,0,1,Maison,208,7,S,sols,,,561,3.908113,49.689834
2021-24506,2021-07-30,000001,Vente,174000,23,,RUE DES MANANTS,0047,02250,02513,Montigny-le-Franc,02,,,025130000A0815,,,,,,,,,,,,,0,3,Dépendance,,0,S,sols,,,561,3.908113,49.689834
2021-24506,2021-07-30,000001,Vente,174000,23,,RUE DES MANANTS,0047,02250,02513,Montigny-le-Franc,02,,,025130000A0815,,,,,,,,,,,,,0,3,Dépendance,,0,S,sols,,,561,3.908113,49.689834
2021-25304,2021-09-02,000001,Vente,8500,,,LES CARRIERES,B007,02250,02513,Montigny-le-Franc,02,,,025130000A0703,,,,,,,,,,,,,0,,,,,PA,pâtures,,,4355,3.910564,49.687436
2021-25959,2021-09-21,000001,Vente,10433,,,LA CROIX MARQUIS(NORD),B018,02250,02513,Montigny-le-Franc,02,,,02513000ZO0018,,,,,,,,,,,,,0,,,,,T,terres,,,3259,3.896038,49.701717
2021-27138,2021-11-03,000003,Echange,13000,,,LA VOYETTE DE LA HAYE,B051,02250,02513,Montigny-le-Franc,02,,,02513000ZH0019,,,,,,,,,,,,,0,,,,,T,terres,,,14990,3.9378,49.692429
2021-27618,2021-11-20,000001,Vente,57000,,,LE VILLAGE,B050,02250,02513,Montigny-le-Franc,02,,,025130000A0408,,,,,,,,,,,,,0,,,,,J,jardins,,,620,3.905891,49.689828
2021-27618,2021-11-20,000001,Vente,57000,39,,RUE DES MANANTS,0047,02250,02513,Montigny-le-Franc,02,,,025130000A0409,,,,,,,,,,,,,0,1,Maison,80,4,S,sols,,,540,3.906138,49.6895
2021-27618,2021-11-20,000001,Vente,57000,39,,RUE DES MANANTS,0047,02250,02513,Montigny-le-Franc,02,,,025130000A0409,,,,,,,,,,,,,0,3,Dépendance,,0,S,sols,,,540,3.906138,49.6895
2021-27618,2021-11-20,000001,Vente,57000,39,,RUE DES MANANTS,0047,02250,02513,Montigny-le-Franc,02,,,025130000A0409,,,,,,,,,,,,,0,3,Dépendance,,0,S,sols,,,540,3.906138,49.6895
2021-27618,2021-11-20,000001,Vente,57000,39,,RUE DES MANANTS,0047,02250,02513,Montigny-le-Franc,02,,,025130000A0409,,,,,,,,,,,,,0,3,Dépendance,,0,S,sols,,,540,3.906138,49.6895
2021-29050,2021-12-20,000001,Echange,33000,,,LE MONT DE MARLE,B036,02250,02513,Montigny-le-Franc,02,,,02513000ZD0044,,,,,,,,,,,,,0,,,,,T,terres,,,25630,3.897651,49.696466
2021-29050,2021-12-20,000001,Echange,33000,,,LE BAQUET NANETTE,B001,02250,02513,Montigny-le-Franc,02,,,02513000ZL0004,,,,,,,,,,,,,0,,,,,T,terres,,,13730,3.913522,49.685779
2021-29053,2021-12-20,000004,Echange,15900,,,LE FOND NICOLAS CARLIER,B029,02250,02513,Montigny-le-Franc,02,,,02513000ZH0041,,,,,,,,,,,,,0,,,,,T,terres,,,6310,3.941267,49.6921
2021-29053,2021-12-20,000004,Echange,15900,,,LE CHEMIN DE LAON,B012,02250,02513,Montigny-le-Franc,02,,,02513000ZK0005,,,,,,,,,,,,,0,,,,,T,terres,,,13450,3.92082,49.683688
