id_mutation,date_mutation,numero_disposition,nature_mutation,valeur_fonciere,adresse_numero,adresse_suffixe,adresse_nom_voie,adresse_code_voie,code_postal,code_commune,nom_commune,code_departement,ancien_code_commune,ancien_nom_commune,id_parcelle,ancien_id_parcelle,numero_volume,lot1_numero,lot1_surface_carrez,lot2_numero,lot2_surface_carrez,lot3_numero,lot3_surface_carrez,lot4_numero,lot4_surface_carrez,lot5_numero,lot5_surface_carrez,nombre_lots,code_type_local,type_local,surface_reelle_bati,nombre_pieces_principales,code_nature_culture,nature_culture,code_nature_culture_speciale,nature_culture_speciale,surface_terrain,longitude,latitude
2021-18485,2021-02-05,000001,Vente,7500,,,SOUS LA CHARBONNIERE,B094,02160,02531,Moussy-Verneuil,02,,,025310000B0286,,,,,,,,,,,,,0,,,,,BT,taillis simples,,,585,3.647201,49.40266
2021-18581,2021-02-11,000001,Vente,2500,20,,RUE DU CHEMIN DES DAMES,0010,02160,02531,Moussy-Verneuil,02,,,025310000A0707,,,,,,,,,,,,,0,1,Maison,20,1,S,sols,,,163,3.639327,49.417092
2021-18581,2021-02-11,000001,Vente,2500,20,,RUE DU CHEMIN DES DAMES,0010,02160,02531,Moussy-Verneuil,02,,,025310000A0707,,,,,,,,,,,,,0,1,Maison,20,1,J,jardins,,,754,3.639327,49.417092
2021-18648,2021-02-26,000001,Vente,3400,,,CHAMP SAINT JEAN,B013,02160,02531,Moussy-Verneuil,02,,,02531000ZE0053,,,,,,,,,,,,,0,,,,,T,terres,,,3160,3.642118,49.400457
2021-18648,2021-02-26,000001,Vente,3400,,,CHAMP SAINT JEAN,B013,02160,02531,Moussy-Verneuil,02,,,02531000ZE0054,,,,,,,,,,,,,0,,,,,T,terres,,,3600,3.642116,49.400288
2021-21751,2021-05-25,000001,Vente,65000,,,LE VILLAGE,B102,02160,02531,Moussy-Verneuil,02,,,025310000A0429,,,,,,,,,,,,,0,,,,,L,landes,,,1355,3.638522,49.416628
2021-21751,2021-05-25,000001,Vente,65000,,,LE GRAND PRE,B053,02160,02531,Moussy-Verneuil,02,,,025310000A0436,,,,,,,,,,,,,0,,,,,BP,peupleraies,,,24295,3.639035,49.414249
2021-21751,2021-05-25,000001,Vente,65000,,,LE GRAND PRE,B053,02160,02531,Moussy-Verneuil,02,,,025310000A0436,,,,,,,,,,,,,0,,,,,PA,pâtures,,,19545,3.639035,49.414249
2021-21751,2021-05-25,000001,Vente,65000,,,LE GRAND PRE,B053,02160,02531,Moussy-Verneuil,02,,,025310000A0440,,,,,,,,,,,,,0,,,,,PA,pâtures,,,15560,3.636744,49.412766
2021-21751,2021-05-25,000001,Vente,65000,,,LE GRAND PRE,B053,02160,02531,Moussy-Verneuil,02,,,025310000A0441,,,,,,,,,,,,,0,,,,,BT,taillis simples,,,9350,3.636713,49.413871
2021-21751,2021-05-25,000001,Vente,65000,,,LA CROIX BERTHE,B027,02160,02531,Moussy-Verneuil,02,,,025310000A0442,,,,,,,,,,,,,0,,,,,BT,taillis simples,,,9870,3.635551,49.413197
2021-21751,2021-05-25,000001,Vente,65000,15,,RUE DU CHEMIN DES DAMES,0010,02160,02531,Moussy-Verneuil,02,,,025310000A0780,,,,,,,,,,,,,0,1,Maison,50,2,E,eaux,,,340,3.639015,49.415993
2021-21751,2021-05-25,000001,Vente,65000,15,,RUE DU CHEMIN DES DAMES,0010,02160,02531,Moussy-Verneuil,02,,,025310000A0780,,,,,,,,,,,,,0,1,Maison,50,2,BS,taillis sous futaie,,,2868,3.639015,49.415993
2021-21751,2021-05-25,000001,Vente,65000,15,,RUE DU CHEMIN DES DAMES,0010,02160,02531,Moussy-Verneuil,02,,,025310000A0780,,,,,,,,,,,,,0,1,Maison,50,2,S,sols,,,2480,3.639015,49.415993
2021-21751,2021-05-25,000001,Vente,65000,15,,RUE DU CHEMIN DES DAMES,0010,02160,02531,Moussy-Verneuil,02,,,025310000A0780,,,,,,,,,,,,,0,1,Maison,50,2,PA,pâtures,,,2503,3.639015,49.415993
2021-21751,2021-05-25,000001,Vente,65000,,,LE VILLAGE,B102,02160,02531,Moussy-Verneuil,02,,,025310000A0782,,,,,,,,,,,,,0,,,,,E,eaux,,,239,3.639989,49.415154
2021-26776,2021-10-07,000001,Vente,28340,,,LE VILLAGE,B102,02160,02531,Moussy-Verneuil,02,,,025310000A0393,,,,,,,,,,,,,0,,,,,AB,terrains a bâtir,,,799,3.636847,49.416647
