id_mutation,date_mutation,numero_disposition,nature_mutation,valeur_fonciere,adresse_numero,adresse_suffixe,adresse_nom_voie,adresse_code_voie,code_postal,code_commune,nom_commune,code_departement,ancien_code_commune,ancien_nom_commune,id_parcelle,ancien_id_parcelle,numero_volume,lot1_numero,lot1_surface_carrez,lot2_numero,lot2_surface_carrez,lot3_numero,lot3_surface_carrez,lot4_numero,lot4_surface_carrez,lot5_numero,lot5_surface_carrez,nombre_lots,code_type_local,type_local,surface_reelle_bati,nombre_pieces_principales,code_nature_culture,nature_culture,code_nature_culture_speciale,nature_culture_speciale,surface_terrain,longitude,latitude
2021-24277,2021-06-07,000001,Vente,,,,LE FOND SAINT LAURENT,B029,02140,02535,Nampcelles-la-Cour,02,,,02535000ZK0021,,,,,,,,,,,,,0,,,,,T,terres,,,7700,4.004649,49.772595
2021-24277,2021-06-07,000001,Vente,,,,LES ANNETTES,B001,02140,02535,Nampcelles-la-Cour,02,,,02535000ZK0037,,,,,,,,,,,,,0,,,,,T,terres,,,4520,3.996508,49.772745
2021-27547,2021-11-19,000001,Vente,150000,2,,RLE JEAN SIMON,0032,02140,02535,Nampcelles-la-Cour,02,,,02535000AB0111,,,,,,,,,,,,,0,1,Maison,104,4,S,sols,,,798,4.001336,49.777894
2021-27547,2021-11-19,000001,Vente,150000,2,,RLE JEAN SIMON,0032,02140,02535,Nampcelles-la-Cour,02,,,02535000AB0111,,,,,,,,,,,,,0,3,Dépendance,,0,S,sols,,,798,4.001336,49.777894
2021-27547,2021-11-19,000001,Vente,150000,,,LE VILLAGE,B064,02140,02535,Nampcelles-la-Cour,02,,,02535000AB0112,,,,,,,,,,,,,0,,,,,J,jardins,,,509,4.000923,49.778035
2021-27778,2021-11-26,000001,Vente,100,,,LE VILLAGE,B064,02140,02535,Nampcelles-la-Cour,02,,,02535000AB0159,,,,,,,,,,,,,0,,,,,PA,pâtures,,,486,4.004774,49.777634
2021-27786,2021-11-26,000001,Vente,131900,5,,RUE AURORE HALLEZ,0005,02140,02535,Nampcelles-la-Cour,02,,,02535000AB0046,,,,,,,,,,,,,0,1,Maison,150,8,S,sols,,,1170,4.004453,49.777584
2021-27786,2021-11-26,000001,Vente,131900,5,,RUE AURORE HALLEZ,0005,02140,02535,Nampcelles-la-Cour,02,,,02535000AB0046,,,,,,,,,,,,,0,3,Dépendance,,0,S,sols,,,1170,4.004453,49.777584
2021-27786,2021-11-26,000001,Vente,131900,,,LE VILLAGE,B064,02140,02535,Nampcelles-la-Cour,02,,,02535000AB0052,,,,,,,,,,,,,0,,,,,PA,pâtures,,,1148,4.005374,49.777482
2021-27786,2021-11-26,000001,Vente,131900,,,LE VILLAGE,B064,02140,02535,Nampcelles-la-Cour,02,,,02535000AB0165,,,,,,,,,,,,,0,,,,,S,sols,,,50,4.004246,49.777749
2021-27786,2021-11-26,000001,Vente,131900,,,LE VILLAGE,B064,02140,02535,Nampcelles-la-Cour,02,,,02535000AB0167,,,,,,,,,,,,,0,,,,,J,jardins,,,521,4.00457,49.777897
2021-27786,2021-11-26,000001,Vente,131900,,,LE VILLAGE,B064,02140,02535,Nampcelles-la-Cour,02,,,02535000AB0170,,,,,,,,,,,,,0,,,,,PA,pâtures,,,6041,4.005301,49.777899
2021-27958,2021-11-26,000001,Vente,1000000,,,BAILLIBELLE,B003,02140,02535,Nampcelles-la-Cour,02,,,02535000ZA0013,,,,,,,,,,,,,0,,,,,T,terres,,,13230,3.9973,49.788203
2021-27958,2021-11-26,000001,Vente,1000000,,,LES EBURGNIERS,B023,02140,02535,Nampcelles-la-Cour,02,,,02535000ZD0003,,,,,,,,,,,,,0,,,,,T,terres,,,484137,4.019805,49.78687
2021-27958,2021-11-26,000001,Vente,1000000,,,LES EBURGNIERS,B023,02140,02535,Nampcelles-la-Cour,02,,,02535000ZD0003,,,,,,,,,,,,,0,,,,,T,terres,,,81315,4.019805,49.78687
2021-27958,2021-11-26,000001,Vente,1000000,,,LES EBURGNIERS,B023,02140,02535,Nampcelles-la-Cour,02,,,02535000ZD0003,,,,,,,,,,,,,0,,,,,T,terres,,,82768,4.019805,49.78687
2021-27958,2021-11-26,000001,Vente,1000000,,,LE FOSSE DES FONDS,B034,02140,02535,Nampcelles-la-Cour,02,,,02535000ZI0002,,,,,,,,,,,,,0,,,,,T,terres,,,33334,4.00013,49.766732
2021-27958,2021-11-26,000001,Vente,1000000,,,LE FOSSE DES FONDS,B034,02140,02535,Nampcelles-la-Cour,02,,,02535000ZI0002,,,,,,,,,,,,,0,,,,,T,terres,,,66666,4.00013,49.766732
