id_mutation,date_mutation,numero_disposition,nature_mutation,valeur_fonciere,adresse_numero,adresse_suffixe,adresse_nom_voie,adresse_code_voie,code_postal,code_commune,nom_commune,code_departement,ancien_code_commune,ancien_nom_commune,id_parcelle,ancien_id_parcelle,numero_volume,lot1_numero,lot1_surface_carrez,lot2_numero,lot2_surface_carrez,lot3_numero,lot3_surface_carrez,lot4_numero,lot4_surface_carrez,lot5_numero,lot5_surface_carrez,nombre_lots,code_type_local,type_local,surface_reelle_bati,nombre_pieces_principales,code_nature_culture,nature_culture,code_nature_culture_speciale,nature_culture_speciale,surface_terrain,longitude,latitude
2021-22967,2021-06-21,000001,Vente,133000,8,,RUE DU CHATEAU,0013,02240,02605,Pleine-Selve,02,,,026050000B0343,,,,,,,,,,,,,0,1,Maison,147,5,S,sols,,,93,3.527121,49.792056
2021-22967,2021-06-21,000001,Vente,133000,8,,RUE DU CHATEAU,0013,02240,02605,Pleine-Selve,02,,,026050000B0343,,,,,,,,,,,,,0,3,Dépendance,,0,S,sols,,,93,3.527121,49.792056
2021-22967,2021-06-21,000001,Vente,133000,,,LE VILLAGE,B037,02240,02605,Pleine-Selve,02,,,026050000B0344,,,,,,,,,,,,,0,,,,,S,sols,,,61,3.527095,49.792007
2021-22967,2021-06-21,000001,Vente,133000,,,RUE DU CHATEAU,0013,02240,02605,Pleine-Selve,02,,,026050000B0372,,,,,,,,,,,,,0,,,,,S,sols,,,315,3.526821,49.79209
2021-22967,2021-06-21,000001,Vente,133000,,,RUE DU CHATEAU,0013,02240,02605,Pleine-Selve,02,,,026050000B0459,,,,,,,,,,,,,0,,,,,S,sols,,,222,3.526802,49.792128
2021-24363,2021-08-19,000001,Vente,65000,,,LA RUE DE LANNEAU,B027,02240,02605,Pleine-Selve,02,,,026050000B0286,,,,,,,,,,,,,0,,,,,J,jardins,,,1510,3.528746,49.79074
2021-24363,2021-08-19,000001,Vente,65000,9,,RUE DE LANNEAU,0035,02240,02605,Pleine-Selve,02,,,026050000B0287,,,,,,,,,,,,,0,1,Maison,50,2,S,sols,,,77,3.528821,49.791056
2021-28748,2021-12-18,000001,Vente,130000,,,LA RUE D ORIGNY,B026,02240,02605,Pleine-Selve,02,,,026050000B0137,,,,,,,,,,,,,0,,,,,J,jardins,,,520,3.526085,49.793506
2021-28748,2021-12-18,000001,Vente,130000,,,LA RUE D ORIGNY,B026,02240,02605,Pleine-Selve,02,,,026050000B0138,,,,,,,,,,,,,0,,,,,J,jardins,,,1184,3.526266,49.793707
2021-28748,2021-12-18,000001,Vente,130000,,,LA RUE D ORIGNY,B026,02240,02605,Pleine-Selve,02,,,026050000B0138,,,,,,,,,,,,,0,,,,,S,sols,,,33,3.526266,49.793707
2021-28748,2021-12-18,000001,Vente,130000,12,,RUE DE FREDERIC DURAIN,0020,02240,02605,Pleine-Selve,02,,,026050000B0139,,,,,,,,,,,,,0,1,Maison,72,3,S,sols,,,189,3.526384,49.79372
2021-28748,2021-12-18,000001,Vente,130000,12,,RUE DE FREDERIC DURAIN,0020,02240,02605,Pleine-Selve,02,,,026050000B0139,,,,,,,,,,,,,0,3,Dépendance,,0,S,sols,,,189,3.526384,49.79372
2021-28748,2021-12-18,000001,Vente,130000,10,,RUE DE FREDERIC DURAIN,0020,02240,02605,Pleine-Selve,02,,,026050000B0140,,,,,,,,,,,,,0,1,Maison,77,3,S,sols,,,107,3.526432,49.793635
2021-28748,2021-12-18,000001,Vente,130000,5000,,LA RUE D ORIGNY,B026,02240,02605,Pleine-Selve,02,,,026050000B0483,,,,,,,,,,,,,0,,,,,S,sols,,,211,3.526236,49.793498
2021-29010,2021-12-14,000001,Vente,55500,1,,RUE DE LANNEAU,0035,02240,02605,Pleine-Selve,02,,,026050000B0274,,,,,,,,,,,,,0,3,Dépendance,,0,S,sols,,,277,3.527072,49.790654
2021-29010,2021-12-14,000001,Vente,55500,1,,RUE DE LANNEAU,0035,02240,02605,Pleine-Selve,02,,,026050000B0274,,,,,,,,,,,,,0,1,Maison,105,4,S,sols,,,277,3.527072,49.790654
2021-29010,2021-12-14,000001,Vente,55500,1,,RUE DE LANNEAU,0035,02240,02605,Pleine-Selve,02,,,026050000B0274,,,,,,,,,,,,,0,3,Dépendance,,0,S,sols,,,277,3.527072,49.790654
2021-29010,2021-12-14,000001,Vente,55500,,,LA RUE DE LANNEAU,B027,02240,02605,Pleine-Selve,02,,,026050000B0385,,,,,,,,,,,,,0,,,,,S,sols,,,416,3.527059,49.790291
