id_mutation,date_mutation,numero_disposition,nature_mutation,valeur_fonciere,adresse_numero,adresse_suffixe,adresse_nom_voie,adresse_code_voie,code_postal,code_commune,nom_commune,code_departement,ancien_code_commune,ancien_nom_commune,id_parcelle,ancien_id_parcelle,numero_volume,lot1_numero,lot1_surface_carrez,lot2_numero,lot2_surface_carrez,lot3_numero,lot3_surface_carrez,lot4_numero,lot4_surface_carrez,lot5_numero,lot5_surface_carrez,nombre_lots,code_type_local,type_local,surface_reelle_bati,nombre_pieces_principales,code_nature_culture,nature_culture,code_nature_culture_speciale,nature_culture_speciale,surface_terrain,longitude,latitude
2021-19564,2021-03-26,000001,Vente,438000,,,ROZIERES(VILLAGE),B048,02200,02663,Rozières-sur-Crise,02,,,026630000A0034,,,,,,,,,,,,,0,,,,,J,jardins,,,3570,3.355681,49.326695
2021-19564,2021-03-26,000001,Vente,438000,1,,RUE DE L EGLISE,0020,02200,02663,Rozières-sur-Crise,02,,,026630000A0035,,,,,,,,,,,,,0,1,Maison,179,7,S,sols,,,928,3.355408,49.326578
2021-19564,2021-03-26,000001,Vente,438000,,,ROZIERES(VILLAGE),B048,02200,02663,Rozières-sur-Crise,02,,,026630000A0036,,,,,,,,,,,,,0,,,,,AG,terrains d'agrément,JARD,Jardin d'agrément,825,3.35567,49.326333
2021-23879,2021-07-16,000001,Vente,210000,13,,RUE DU FAUBOURG D ECUIRY,0025,02200,02663,Rozières-sur-Crise,02,,,026630000B0056,,,,,,,,,,,,,0,2,Appartement,62,3,S,sols,,,592,3.367153,49.325695
2021-23879,2021-07-16,000001,Vente,210000,13,,RUE DU FAUBOURG D ECUIRY,0025,02200,02663,Rozières-sur-Crise,02,,,026630000B0056,,,,,,,,,,,,,0,3,Dépendance,,0,S,sols,,,592,3.367153,49.325695
2021-23879,2021-07-16,000001,Vente,210000,13,,RUE DU FAUBOURG D ECUIRY,0025,02200,02663,Rozières-sur-Crise,02,,,026630000B0056,,,,,,,,,,,,,0,2,Appartement,96,3,S,sols,,,592,3.367153,49.325695
2021-23879,2021-07-16,000001,Vente,210000,13,,RUE DU FAUBOURG D ECUIRY,0025,02200,02663,Rozières-sur-Crise,02,,,026630000B0056,,,,,,,,,,,,,0,4,Local industriel. commercial ou assimilé,60,0,S,sols,,,592,3.367153,49.325695
2021-23879,2021-07-16,000001,Vente,210000,13,,RUE DU FAUBOURG D ECUIRY,0025,02200,02663,Rozières-sur-Crise,02,,,026630000B0056,,,,,,,,,,,,,0,3,Dépendance,,0,S,sols,,,592,3.367153,49.325695
2021-23879,2021-07-16,000001,Vente,210000,13,,RUE DU FAUBOURG D ECUIRY,0025,02200,02663,Rozières-sur-Crise,02,,,026630000B0056,,,,,,,,,,,,,0,3,Dépendance,,0,S,sols,,,592,3.367153,49.325695
2021-23879,2021-07-16,000001,Vente,210000,13,,RUE DU FAUBOURG D ECUIRY,0025,02200,02663,Rozières-sur-Crise,02,,,026630000B0056,,,,,,,,,,,,,0,3,Dépendance,,0,S,sols,,,592,3.367153,49.325695
2021-23879,2021-07-16,000001,Vente,210000,13,,RUE DU FAUBOURG D ECUIRY,0025,02200,02663,Rozières-sur-Crise,02,,,026630000B0056,,,,,,,,,,,,,0,3,Dépendance,,0,S,sols,,,592,3.367153,49.325695
2021-23879,2021-07-16,000001,Vente,210000,,,LE FAUBOURG,B020,02200,02663,Rozières-sur-Crise,02,,,026630000B0472,,,,,,,,,,,,,0,,,,,J,jardins,,,1065,3.367263,49.325854
2021-24231,2021-07-21,000001,Vente,179000,1,,RUE DES TILLEULS,0065,02200,02663,Rozières-sur-Crise,02,,,026630000A0326,,,,,,,,,,,,,0,1,Maison,64,3,J,jardins,,,747,3.348902,49.325727
2021-24231,2021-07-21,000001,Vente,179000,1,,RUE DES TILLEULS,0065,02200,02663,Rozières-sur-Crise,02,,,026630000A0326,,,,,,,,,,,,,0,1,Maison,64,3,S,sols,,,310,3.348902,49.325727
2021-26701,2021-09-27,000001,Vente,72000,4,,CR DU MARAIS,0040,02200,02663,Rozières-sur-Crise,02,,,026630000B0237,,,,,,,,,,,,,0,3,Dépendance,,0,S,sols,,,320,3.386242,49.317666
2021-26701,2021-09-27,000001,Vente,72000,4,,CR DU MARAIS,0040,02200,02663,Rozières-sur-Crise,02,,,026630000B0237,,,,,,,,,,,,,0,3,Dépendance,,0,S,sols,,,320,3.386242,49.317666
2021-26701,2021-09-27,000001,Vente,72000,4,,CR DU MARAIS,0040,02200,02663,Rozières-sur-Crise,02,,,026630000B0237,,,,,,,,,,,,,0,3,Dépendance,,0,S,sols,,,320,3.386242,49.317666
2021-26701,2021-09-27,000001,Vente,72000,4,,CR DU MARAIS,0040,02200,02663,Rozières-sur-Crise,02,,,026630000B0237,,,,,,,,,,,,,0,3,Dépendance,,0,S,sols,,,320,3.386242,49.317666
2021-26701,2021-09-27,000001,Vente,72000,4,,CR DU MARAIS,0040,02200,02663,Rozières-sur-Crise,02,,,026630000B0237,,,,,,,,,,,,,0,1,Maison,50,3,S,sols,,,320,3.386242,49.317666
2021-26701,2021-09-27,000001,Vente,72000,,,MESMIN(HAMEAU),B028,02200,02663,Rozières-sur-Crise,02,,,026630000B0238,,,,,,,,,,,,,0,,,,,S,sols,,,40,3.386316,49.317606
2021-26701,2021-09-27,000001,Vente,72000,,,MESMIN(HAMEAU),B028,02200,02663,Rozières-sur-Crise,02,,,026630000B0406,,,,,,,,,,,,,0,,,,,J,jardins,,,290,3.386454,49.317608
2021-26701,2021-09-27,000001,Vente,72000,,,MESMIN(HAMEAU),B028,02200,02663,Rozières-sur-Crise,02,,,026630000B0485,,,,,,,,,,,,,0,,,,,S,sols,,,160,3.386074,49.317747
2021-26701,2021-09-27,000001,Vente,72000,,,MESMIN(HAMEAU),B028,02200,02663,Rozières-sur-Crise,02,,,026630000B0486,,,,,,,,,,,,,0,,,,,S,sols,,,110,3.386354,49.317529
2021-28821,2021-12-09,000001,Vente,33000,,,AU-DESSUS DU VILLAGE,B001,02200,02663,Rozières-sur-Crise,02,,,02663000ZA0078,,,,,,,,,,,,,0,,,,,AB,terrains a bâtir,,,1040,3.350236,49.325608
2021-29388,2021-12-30,000002,Vente,150000,,,ECUIRY,B018,02200,02663,Rozières-sur-Crise,02,,,026630000B0559,,,,,,,,,,,,,0,,,,,S,sols,,,543,3.372955,49.321944
