id_mutation,date_mutation,numero_disposition,nature_mutation,valeur_fonciere,adresse_numero,adresse_suffixe,adresse_nom_voie,adresse_code_voie,code_postal,code_commune,nom_commune,code_departement,ancien_code_commune,ancien_nom_commune,id_parcelle,ancien_id_parcelle,numero_volume,lot1_numero,lot1_surface_carrez,lot2_numero,lot2_surface_carrez,lot3_numero,lot3_surface_carrez,lot4_numero,lot4_surface_carrez,lot5_numero,lot5_surface_carrez,nombre_lots,code_type_local,type_local,surface_reelle_bati,nombre_pieces_principales,code_nature_culture,nature_culture,code_nature_culture_speciale,nature_culture_speciale,surface_terrain,longitude,latitude
2021-18974,2021-02-24,000001,Vente,20000,,,LES PRES BOSSUS,B072,02130,02806,Villeneuve-sur-Fère,02,,,028060000A0868,,,,,,,,,,,,,0,,,,,BS,taillis sous futaie,,,645,3.484393,49.168227
2021-18974,2021-02-24,000001,Vente,20000,,,LA PLAINE,B066,02130,02806,Villeneuve-sur-Fère,02,,,028060000A0976,,,,,,,,,,,,,0,,,,,BS,taillis sous futaie,,,2441,3.483068,49.168222
2021-18974,2021-02-24,000001,Vente,20000,,,BELLE FONTAINE,B007,02130,02806,Villeneuve-sur-Fère,02,,,028060000B1734,,,,,,,,,,,,,0,,,,,BS,taillis sous futaie,,,3125,3.469811,49.18984
2021-18974,2021-02-24,000001,Vente,20000,,,MAISON NEUVE,B055,02130,02806,Villeneuve-sur-Fère,02,,,02806000ZB0003,,,,,,,,,,,,,0,,,,,P,prés,,,22900,3.481149,49.173853
2021-18974,2021-02-24,000001,Vente,20000,,,MAISON NEUVE,B055,02130,02806,Villeneuve-sur-Fère,02,,,02806000ZB0060,,,,,,,,,,,,,0,,,,,P,prés,,,2050,3.482072,49.17336
2021-19816,2021-03-27,000001,Vente,40000,,,LA PLAINE,B066,02130,02806,Villeneuve-sur-Fère,02,,,028060000A1408,,,,,,,,,,,,,0,,,,,AB,terrains a bâtir,,,2131,3.481502,49.170267
2021-22133,2021-06-24,000001,Vente,22500,,,LA RUE DE CHINCHY,B081,02130,02806,Villeneuve-sur-Fère,02,,,028060000B0828,,,,,,,,,,,,,0,,,,,T,terres,,,755,3.470445,49.177806
2021-22192,2021-06-17,000001,Vente,75000,4,,RUE DE LA CENSE,0011,02130,02806,Villeneuve-sur-Fère,02,,,028060000A0651,,,,,,,,,,,,,0,1,Maison,63,3,S,sols,,,82,3.476267,49.177142
2021-22192,2021-06-17,000001,Vente,75000,5042,,RUE DE LA CENSE,0011,02130,02806,Villeneuve-sur-Fère,02,,,028060000A0652,,,,,,,,,,,,,0,,,,,S,sols,,,65,3.47619,49.177169
2021-22192,2021-06-17,000001,Vente,75000,,,VILLAGE DE VILLENEUVE,B098,02130,02806,Villeneuve-sur-Fère,02,,,028060000A0653,,,,,,,,,,,,,0,,,,,S,sols,,,106,3.476162,49.177097
2021-22192,2021-06-17,000001,Vente,75000,5042,,RUE DE LA CENSE,0011,02130,02806,Villeneuve-sur-Fère,02,,,028060000A0655,,,,,,,,,,,,,0,,,,,S,sols,,,70,3.476095,49.176923
2021-22192,2021-06-17,000001,Vente,75000,4,,RUE DE LA CENSE,0011,02130,02806,Villeneuve-sur-Fère,02,,,028060000A1330,,,,,,,,,,,,,0,3,Dépendance,,0,S,sols,,,42,3.476254,49.177032
2021-22287,2021-06-17,000001,Vente,30000,,,PREAUX FERME,B071,02130,02806,Villeneuve-sur-Fère,02,,,028060000A1413,,,,,,,,,,,,,0,,,,,S,sols,,,2270,3.497134,49.161229
2021-24813,2021-08-17,000001,Vente,132000,41,,RUE PIGNON DE CHINCHY,0044,02130,02806,Villeneuve-sur-Fère,02,,,02806000ZK0084,,,,,,,,,,,,,0,1,Maison,84,5,S,sols,,,710,3.467334,49.178185
2021-24813,2021-08-17,000001,Vente,132000,41,,RUE PIGNON DE CHINCHY,0044,02130,02806,Villeneuve-sur-Fère,02,,,02806000ZK0084,,,,,,,,,,,,,0,3,Dépendance,,0,S,sols,,,710,3.467334,49.178185
2021-27621,2021-11-26,000001,Vente,137000,35,,RUE PIGNON DE CHINCHY,0044,02130,02806,Villeneuve-sur-Fère,02,,,02806000ZK0081,,,,,,,,,,,,,0,1,Maison,66,4,S,sols,,,828,3.468064,49.178059
2021-27621,2021-11-26,000001,Vente,137000,35,,RUE PIGNON DE CHINCHY,0044,02130,02806,Villeneuve-sur-Fère,02,,,02806000ZK0081,,,,,,,,,,,,,0,3,Dépendance,,0,S,sols,,,828,3.468064,49.178059
2021-28239,2021-11-27,000001,Vente,32018.75,,,LA MARNEUSE,B056,02130,02806,Villeneuve-sur-Fère,02,,,02806000ZB0044,,,,,,,,,,,,,0,,,,,P,prés,,,1090,3.485764,49.169813
2021-28239,2021-11-27,000001,Vente,32018.75,,,LA MARNEUSE,B056,02130,02806,Villeneuve-sur-Fère,02,,,02806000ZB0044,,,,,,,,,,,,,0,,,,,BT,taillis simples,,,2200,3.485764,49.169813
2021-28239,2021-11-27,000001,Vente,32018.75,,,VENDIERES,B091,02130,02806,Villeneuve-sur-Fère,02,,,02806000ZI0147,,,,,,,,,,,,,0,,,,,T,terres,,,6870,3.464157,49.172717
2021-28239,2021-11-27,000001,Vente,32018.75,,,VENDIERES,B091,02130,02806,Villeneuve-sur-Fère,02,,,02806000ZI0147,,,,,,,,,,,,,0,,,,,T,terres,,,6870,3.464157,49.172717
2021-28239,2021-11-27,000001,Vente,32018.75,,,BELLE FONTAINE,B007,02130,02806,Villeneuve-sur-Fère,02,,,02806000ZL0033,,,,,,,,,,,,,0,,,,,T,terres,,,6340,3.46874,49.184793
2021-28239,2021-11-27,000001,Vente,32018.75,,,BELLE FONTAINE,B007,02130,02806,Villeneuve-sur-Fère,02,,,02806000ZL0034,,,,,,,,,,,,,0,,,,,T,terres,,,10280,3.468878,49.185243
2021-28239,2021-11-27,000001,Vente,32018.75,,,LA RESERVE,B078,02130,02806,Villeneuve-sur-Fère,02,,,02806000ZL0036,,,,,,,,,,,,,0,,,,,T,terres,,,7860,3.471681,49.186072
2021-28239,2021-11-27,000001,Vente,32018.75,,,LA RESERVE,B078,02130,02806,Villeneuve-sur-Fère,02,,,02806000ZL0036,,,,,,,,,,,,,0,,,,,T,terres,,,7860,3.471681,49.186072
2021-28239,2021-11-27,000001,Vente,32018.75,,,LA RESERVE,B078,02130,02806,Villeneuve-sur-Fère,02,,,02806000ZL0037,,,,,,,,,,,,,0,,,,,T,terres,,,930,3.472014,49.185832
2021-28239,2021-11-27,000001,Vente,32018.75,,,LA RESERVE,B078,02130,02806,Villeneuve-sur-Fère,02,,,02806000ZL0037,,,,,,,,,,,,,0,,,,,T,terres,,,930,3.472014,49.185832
2021-30185,2021-01-19,000001,Vente,22000,14,,RUE CAMILLE CLAUDEL,0010,02130,02806,Villeneuve-sur-Fère,02,,,028060000A0201,,,,,,,,,,,,,0,1,Maison,30,2,S,sols,,,96,3.475358,49.179031
