id_mutation,date_mutation,numero_disposition,nature_mutation,valeur_fonciere,adresse_numero,adresse_suffixe,adresse_nom_voie,adresse_code_voie,code_postal,code_commune,nom_commune,code_departement,ancien_code_commune,ancien_nom_commune,id_parcelle,ancien_id_parcelle,numero_volume,lot1_numero,lot1_surface_carrez,lot2_numero,lot2_surface_carrez,lot3_numero,lot3_surface_carrez,lot4_numero,lot4_surface_carrez,lot5_numero,lot5_surface_carrez,nombre_lots,code_type_local,type_local,surface_reelle_bati,nombre_pieces_principales,code_nature_culture,nature_culture,code_nature_culture_speciale,nature_culture_speciale,surface_terrain,longitude,latitude
2021-32338,2021-09-27,000002,Vente,1,17,,RUE DE POUZAT,0090,03500,03188,Montord,03,,,03188000ZC0139,,,,,,,,,,,,,0,,,,,S,sols,,,95,3.238101,46.298369
2021-32428,2021-09-27,000002,Vente,69000,6,,IMP DE LA CHENAL,0045,03500,03188,Montord,03,,,03188000ZC0136,,,,,,,,,,,,,0,1,Maison,80,3,,,,,,3.237976,46.298009
2021-32428,2021-09-27,000002,Vente,69000,6,,IMP DE LA CHENAL,0045,03500,03188,Montord,03,,,03188000ZC0136,,,,,,,,,,,,,0,3,Dépendance,,0,,,,,,3.237976,46.298009
2021-32428,2021-09-27,000002,Vente,69000,6,,IMP DE LA CHENAL,0045,03500,03188,Montord,03,,,03188000ZC0136,,,,,,,,,,,,,0,3,Dépendance,,0,,,,,,3.237976,46.298009
2021-39515,2021-01-29,000001,Vente,17000,17,,RUE DE POUZAT,0090,03500,03188,Montord,03,,,03188000ZC0071,,,,,,,,,,,,,0,3,Dépendance,,0,S,sols,,,1230,,
2021-39515,2021-01-29,000001,Vente,17000,17,,RUE DE POUZAT,0090,03500,03188,Montord,03,,,03188000ZC0071,,,,,,,,,,,,,0,3,Dépendance,,0,S,sols,,,1230,,
2021-39515,2021-01-29,000001,Vente,17000,17,,RUE DE POUZAT,0090,03500,03188,Montord,03,,,03188000ZC0071,,,,,,,,,,,,,0,3,Dépendance,,0,S,sols,,,1230,,
2021-39515,2021-01-29,000001,Vente,17000,17,,RUE DE POUZAT,0090,03500,03188,Montord,03,,,03188000ZC0071,,,,,,,,,,,,,0,1,Maison,70,3,S,sols,,,1230,,
2021-39602,2021-03-05,000001,Vente,130560,1,,RUE DU CUL DE SAC,0055,03500,03188,Montord,03,,,03188000ZB0043,,,,,,,,,,,,,0,1,Maison,90,4,S,sols,,,495,3.23058,46.292774
2021-39737,2021-04-15,000001,Vente,27000,2,,PL DES MARRONNIERS,0080,03500,03188,Montord,03,,,03188000ZB0101,,,,,,,,,,,,,0,4,Local industriel. commercial ou assimilé,255,0,S,sols,,,328,3.230171,46.292337
2021-39737,2021-04-15,000001,Vente,27000,,,PL DES MARRONNIERS,0080,03500,03188,Montord,03,,,03188000ZB0103,,,,,,,,,,,,,0,,,,,S,sols,,,400,3.230321,46.292308
2021-39948,2021-05-20,000001,Vente,86000,2,,RTE DE CHAREIL,0030,03500,03188,Montord,03,,,03188000ZB0064,,,,,,,,,,,,,0,1,Maison,130,6,S,sols,,,553,3.229854,46.292602
2021-39948,2021-05-20,000001,Vente,86000,2,,RTE DE CHAREIL,0030,03500,03188,Montord,03,,,03188000ZB0064,,,,,,,,,,,,,0,3,Dépendance,,0,S,sols,,,553,3.229854,46.292602
