id_mutation,date_mutation,numero_disposition,nature_mutation,valeur_fonciere,adresse_numero,adresse_suffixe,adresse_nom_voie,adresse_code_voie,code_postal,code_commune,nom_commune,code_departement,ancien_code_commune,ancien_nom_commune,id_parcelle,ancien_id_parcelle,numero_volume,lot1_numero,lot1_surface_carrez,lot2_numero,lot2_surface_carrez,lot3_numero,lot3_surface_carrez,lot4_numero,lot4_surface_carrez,lot5_numero,lot5_surface_carrez,nombre_lots,code_type_local,type_local,surface_reelle_bati,nombre_pieces_principales,code_nature_culture,nature_culture,code_nature_culture_speciale,nature_culture_speciale,surface_terrain,longitude,latitude
2021-33717,2021-10-28,000001,Vente,15000,,,LES CHANOTS,B010,03140,03278,Taxat-Senat,03,,,032780000C0099,,,,,,,,,,,,,0,,,,,T,terres,,,4090,3.137891,46.196754
2021-39386,2021-01-08,000001,Vente,24000,,,LE MENETROL,B039,03140,03278,Taxat-Senat,03,,,03278000ZL0014,,,,,,,,,,,,,0,,,,,T,terres,,,16890,3.128704,46.205992
2021-39386,2021-01-08,000001,Vente,24000,,,LE MENETROL,B039,03140,03278,Taxat-Senat,03,,,03278000ZL0021,,,,,,,,,,,,,0,,,,,T,terres,,,15510,3.13041,46.206501
2021-39676,2021-03-23,000001,Vente,98000,,,LE BOURG,B002,03140,03278,Taxat-Senat,03,,,032780000C0220,,,,,,,,,,,,,0,,,,,T,terres,,,5340,3.141078,46.201914
2021-39676,2021-03-23,000001,Vente,98000,,,LE BOURG,B002,03140,03278,Taxat-Senat,03,,,032780000C0221,,,,,,,,,,,,,0,,,,,P,prés,,,4983,3.140893,46.201476
2021-39676,2021-03-23,000001,Vente,98000,,,LE BOURG,B002,03140,03278,Taxat-Senat,03,,,032780000C0222,,,,,,,,,,,,,0,,,,,J,jardins,,,534,3.14022,46.201215
2021-39676,2021-03-23,000001,Vente,98000,15,,RTE DU FRENE,0080,03140,03278,Taxat-Senat,03,,,032780000C0223,,,,,,,,,,,,,0,1,Maison,67,4,S,sols,,,942,3.140791,46.201295
2021-39676,2021-03-23,000001,Vente,98000,15,,RTE DU FRENE,0080,03140,03278,Taxat-Senat,03,,,032780000C0223,,,,,,,,,,,,,0,3,Dépendance,,0,S,sols,,,942,3.140791,46.201295
2021-39818,2021-05-12,000001,Echange,3708.8,,,LE BOURG,B002,03140,03278,Taxat-Senat,03,,,032780000C0208,,,,,,,,,,,,,0,,,,,P,prés,,,4636,3.139925,46.202836
2021-39819,2021-05-12,000002,Echange,2165,,,CHIBRE,B013,03140,03278,Taxat-Senat,03,,,03278000ZI0028,,,,,,,,,,,,,0,,,,,T,terres,,,2150,3.14925,46.198325
2021-40158,2021-07-03,000001,Vente,35440,,,LES CHAUMES,B012,03140,03278,Taxat-Senat,03,,,03278000ZR0002,,,,,,,,,,,,,0,,,,,P,prés,,,9910,3.124366,46.229536
2021-40158,2021-07-03,000001,Vente,35440,,,LES CHAUMES,B012,03140,03278,Taxat-Senat,03,,,03278000ZR0004,,,,,,,,,,,,,0,,,,,P,prés,,,34600,3.124567,46.22681
