id_mutation,date_mutation,numero_disposition,nature_mutation,valeur_fonciere,adresse_numero,adresse_suffixe,adresse_nom_voie,adresse_code_voie,code_postal,code_commune,nom_commune,code_departement,ancien_code_commune,ancien_nom_commune,id_parcelle,ancien_id_parcelle,numero_volume,lot1_numero,lot1_surface_carrez,lot2_numero,lot2_surface_carrez,lot3_numero,lot3_surface_carrez,lot4_numero,lot4_surface_carrez,lot5_numero,lot5_surface_carrez,nombre_lots,code_type_local,type_local,surface_reelle_bati,nombre_pieces_principales,code_nature_culture,nature_culture,code_nature_culture_speciale,nature_culture_speciale,surface_terrain,longitude,latitude
2021-40583,2021-01-20,000001,Vente,10000,,,LE DESSOUS DE LA ROUTE,B016,04200,04013,Aubignosc,04,,,04013000ZA0098,,,,,,,,,,,,,0,,,,,VI,vignes,,,1943,5.978588,44.130638
2021-40583,2021-01-20,000001,Vente,10000,,,LE DESSOUS DE LA ROUTE,B016,04200,04013,Aubignosc,04,,,04013000ZA0098,,,,,,,,,,,,,0,,,,,T,terres,,,1931,5.978588,44.130638
2021-41030,2021-03-05,000001,Vente,300000,9001,,SOUS LES PRESIDENTES,B061,04200,04013,Aubignosc,04,,,04013000ZA0409,,,,,,,,,,,,,0,4,Local industriel. commercial ou assimilé,380,0,S,sols,,,979,5.982386,44.125975
2021-41030,2021-03-05,000001,Vente,300000,,,SOUS LES PRESIDENTES,B061,04200,04013,Aubignosc,04,,,04013000ZA0415,,,,,,,,,,,,,0,,,,,T,terres,,,1126,5.982804,44.12564
2021-41030,2021-03-05,000001,Vente,300000,,,SOUS LES PRESIDENTES,B061,04200,04013,Aubignosc,04,,,04013000ZA0415,,,,,,,,,,,,,0,,,,,T,terres,,,1126,5.982804,44.12564
2021-41030,2021-03-05,000001,Vente,300000,,,SOUS LES PRESIDENTES,B061,04200,04013,Aubignosc,04,,,04013000ZA0460,,,,,,,,,,,,,0,,,,,T,terres,,,240,5.98312,44.125529
2021-41030,2021-03-05,000001,Vente,300000,,,SOUS LES PRESIDENTES,B061,04200,04013,Aubignosc,04,,,04013000ZA0462,,,,,,,,,,,,,0,,,,,T,terres,,,290,5.982534,44.125938
2021-41088,2021-02-24,000002,Vente,59904,7147,,CHE DE LA VICAIRIE,0074,04200,04013,Aubignosc,04,,,04013000ZA0608,,,,,,,,,,,,,0,1,Maison,68,3,S,sols,,,1664,5.96892,44.131207
2021-41088,2021-02-24,000002,Vente,59904,7147,,CHE DE LA VICAIRIE,0074,04200,04013,Aubignosc,04,,,04013000ZA0608,,,,,,,,,,,,,0,1,Maison,79,4,S,sols,,,1664,5.96892,44.131207
2021-41088,2021-02-24,000002,Vente,59904,7147,,CHE DE LA VICAIRIE,0074,04200,04013,Aubignosc,04,,,04013000ZA0608,,,,,,,,,,,,,0,1,Maison,79,4,S,sols,,,1664,5.96892,44.131207
2021-41088,2021-02-24,000002,Vente,59904,7147,,CHE DE LA VICAIRIE,0074,04200,04013,Aubignosc,04,,,04013000ZA0608,,,,,,,,,,,,,0,1,Maison,53,2,S,sols,,,1664,5.96892,44.131207
2021-41088,2021-02-24,000002,Vente,59904,7147,,CHE DE LA VICAIRIE,0074,04200,04013,Aubignosc,04,,,04013000ZA0608,,,,,,,,,,,,,0,1,Maison,64,3,S,sols,,,1664,5.96892,44.131207
2021-41088,2021-02-24,000002,Vente,59904,7147,,CHE DE LA VICAIRIE,0074,04200,04013,Aubignosc,04,,,04013000ZA0608,,,,,,,,,,,,,0,1,Maison,68,3,S,sols,,,1664,5.96892,44.131207
2021-41088,2021-02-24,000002,Vente,59904,7147,,CHE DE LA VICAIRIE,0074,04200,04013,Aubignosc,04,,,04013000ZA0608,,,,,,,,,,,,,0,1,Maison,68,3,S,sols,,,1664,5.96892,44.131207
2021-41088,2021-02-24,000002,Vente,59904,7147,,CHE DE LA VICAIRIE,0074,04200,04013,Aubignosc,04,,,04013000ZA0608,,,,,,,,,,,,,0,1,Maison,68,3,S,sols,,,1664,5.96892,44.131207
2021-41088,2021-02-24,000002,Vente,59904,7147,,CHE DE LA VICAIRIE,0074,04200,04013,Aubignosc,04,,,04013000ZA0608,,,,,,,,,,,,,0,1,Maison,79,4,S,sols,,,1664,5.96892,44.131207
2021-41088,2021-02-24,000002,Vente,59904,7147,,CHE DE LA VICAIRIE,0074,04200,04013,Aubignosc,04,,,04013000ZA0608,,,,,,,,,,,,,0,1,Maison,53,2,S,sols,,,1664,5.96892,44.131207
2021-41088,2021-02-24,000002,Vente,59904,7147,,CHE DE LA VICAIRIE,0074,04200,04013,Aubignosc,04,,,04013000ZA0608,,,,,,,,,,,,,0,1,Maison,68,3,S,sols,,,1664,5.96892,44.131207
2021-41088,2021-02-24,000002,Vente,59904,7147,,CHE DE LA VICAIRIE,0074,04200,04013,Aubignosc,04,,,04013000ZA0608,,,,,,,,,,,,,0,1,Maison,53,2,S,sols,,,1664,5.96892,44.131207
2021-41088,2021-02-24,000002,Vente,59904,7147,,CHE DE LA VICAIRIE,0074,04200,04013,Aubignosc,04,,,04013000ZA0608,,,,,,,,,,,,,0,1,Maison,68,3,S,sols,,,1664,5.96892,44.131207
2021-41088,2021-02-24,000002,Vente,59904,7147,,CHE DE LA VICAIRIE,0074,04200,04013,Aubignosc,04,,,04013000ZA0608,,,,,,,,,,,,,0,1,Maison,64,3,S,sols,,,1664,5.96892,44.131207
2021-41088,2021-02-24,000002,Vente,59904,7147,,CHE DE LA VICAIRIE,0074,04200,04013,Aubignosc,04,,,04013000ZA0608,,,,,,,,,,,,,0,1,Maison,53,2,S,sols,,,1664,5.96892,44.131207
2021-41190,2021-02-23,000001,Vente,25600,,,LES PETITES GREZES,B041,04200,04013,Aubignosc,04,,,04013000ZB0024,,,,,,,,,,,,,0,,,,,T,terres,,,27859,5.953493,44.126437
2021-41447,2021-03-19,000001,Vente,120000,5069,,LE VILLAGE,B068,04200,04013,Aubignosc,04,,,040130000B2025,,,,,,,,,,,,,0,1,Maison,80,4,S,sols,,,393,5.967995,44.129483
2021-41447,2021-03-19,000001,Vente,120000,5069,,LE VILLAGE,B068,04200,04013,Aubignosc,04,,,040130000B2025,,,,,,,,,,,,,0,1,Maison,47,3,S,sols,,,393,5.967995,44.129483
2021-41447,2021-03-19,000001,Vente,120000,5069,,LE VILLAGE,B068,04200,04013,Aubignosc,04,,,040130000B2025,,,,,,,,,,,,,0,1,Maison,47,3,S,sols,,,393,5.967995,44.129483
2021-41447,2021-03-19,000001,Vente,120000,5069,,LE VILLAGE,B068,04200,04013,Aubignosc,04,,,040130000B2025,,,,,,,,,,,,,0,1,Maison,79,4,S,sols,,,393,5.967995,44.129483
2021-41451,2021-03-19,000001,Vente,75000,,,LE VILLAGE,B068,04200,04013,Aubignosc,04,,,040130000B2028,,,,,,,,,,,,,0,,,,,S,sols,,,345,5.968334,44.129656
2021-41451,2021-03-19,000001,Vente,75000,,,LE VILLAGE,B068,04200,04013,Aubignosc,04,,,040130000B2026,,,,,,,,,,,,,0,,,,,S,sols,,,355,5.968117,44.129576
2021-41770,2021-04-21,000002,Vente,1000,,,MAURIEU,B038,04200,04013,Aubignosc,04,,,040130000B2032,,,,,,,,,,,,,0,,,,,S,sols,,,157,5.971846,44.12781
2021-42210,2021-05-10,000001,Vente,1,,,LES ROUBINAS,B052,04200,04013,Aubignosc,04,,,040130000B1979,,,,,,,,,,,,,0,,,,,BR,futaies résineuses,,,7,5.971066,44.128272
2021-42210,2021-05-10,000001,Vente,1,,,LES ROUBINAS,B052,04200,04013,Aubignosc,04,,,040130000B1981,,,,,,,,,,,,,0,,,,,BR,futaies résineuses,,,6,5.971068,44.128289
2021-42210,2021-05-10,000002,Vente,1,,,LES ROUBINAS,B052,04200,04013,Aubignosc,04,,,040130000B1253,,,,,,,,,,,,,0,,,,,BR,futaies résineuses,,,14,5.970916,44.128227
2021-42210,2021-05-10,000002,Vente,1,,,LES ROUBINAS,B052,04200,04013,Aubignosc,04,,,040130000B1978,,,,,,,,,,,,,0,,,,,BR,futaies résineuses,,,40,5.970961,44.128228
2021-42210,2021-05-10,000002,Vente,1,,,LES ROUBINAS,B052,04200,04013,Aubignosc,04,,,040130000B1980,,,,,,,,,,,,,0,,,,,BR,futaies résineuses,,,3,5.971018,44.128271
2021-42526,2021-06-05,000001,Vente,140000,5024,,LE FOREST,B022,04200,04013,Aubignosc,04,,,040130000B0115,,,,,,,,,,,,,0,1,Maison,70,3,S,sols,,,310,5.954463,44.120295
2021-42649,2021-06-17,000001,Vente,240000,,,LE VILLAGE,B068,04200,04013,Aubignosc,04,,,040130000B1363,,,,,,,,,,,,,0,,,,,S,sols,,,683,5.966716,44.130343
2021-42649,2021-06-17,000001,Vente,240000,7052,,LA VICAIRIE,B067,04200,04013,Aubignosc,04,,,040130000B1365,,,,,,,,,,,,,0,1,Maison,113,4,S,sols,,,830,5.966801,44.130511
2021-42668,2021-06-11,000001,Vente,4000,,,SOUS LES PRESIDENTES,B061,04200,04013,Aubignosc,04,,,04013000ZA0081,,,,,,,,,,,,,0,,,,,T,terres,,,446,5.980613,44.129055
2021-42668,2021-06-11,000001,Vente,4000,,,SOUS LES PRESIDENTES,B061,04200,04013,Aubignosc,04,,,04013000ZA0082,,,,,,,,,,,,,0,,,,,T,terres,,,520,5.980517,44.129187
2021-43276,2021-07-29,000001,Vente,286200,5090,,LE DESSOUS DE CHAMP GIRARD,B015,04200,04013,Aubignosc,04,,,04013000ZA0107,,,,,,,,,,,,,0,1,Maison,114,6,S,sols,,,1045,5.972554,44.131397
2021-43276,2021-07-29,000001,Vente,286200,,,LE DESSOUS DE CHAMP GIRARD,B015,04200,04013,Aubignosc,04,,,04013000ZA0250,,,,,,,,,,,,,0,,,,,T,terres,,,1893,5.972815,44.13158
2021-43411,2021-07-29,000001,Vente,7500,,,LES FILLIERES,B021,04200,04013,Aubignosc,04,,,040130000B0861,,,,,,,,,,,,,0,,,,,T,terres,,,8120,5.993627,44.115343
2021-43497,2021-07-29,000001,Vente,292500,5078,,LES FILLIERES,B021,04200,04013,Aubignosc,04,,,040130000B1319,,,,,,,,,,,,,0,4,Local industriel. commercial ou assimilé,195,0,S,sols,,,1020,5.995237,44.114415
2021-43497,2021-07-29,000001,Vente,292500,5078,,LES FILLIERES,B021,04200,04013,Aubignosc,04,,,040130000B1319,,,,,,,,,,,,,0,4,Local industriel. commercial ou assimilé,315,0,S,sols,,,1020,5.995237,44.114415
2021-43497,2021-07-29,000001,Vente,292500,,,LES FILLIERES,B021,04200,04013,Aubignosc,04,,,040130000B1321,,,,,,,,,,,,,0,,,,,VE,vergers,,,445,5.994999,44.114232
2021-43497,2021-07-29,000001,Vente,292500,,,LES FILLIERES,B021,04200,04013,Aubignosc,04,,,040130000B1322,,,,,,,,,,,,,0,,,,,T,terres,,,3470,5.994859,44.114592
2021-43497,2021-07-29,000001,Vente,292500,,,LES FILLIERES,B021,04200,04013,Aubignosc,04,,,040130000B1798,,,,,,,,,,,,,0,,,,,L,landes,,,521,5.994823,44.114179
2021-43497,2021-07-29,000001,Vente,292500,,,LES FILLIERES,B021,04200,04013,Aubignosc,04,,,040130000B1800,,,,,,,,,,,,,0,,,,,S,sols,,,20,5.995234,44.114057
2021-43497,2021-07-29,000001,Vente,292500,,,LES FILLIERES,B021,04200,04013,Aubignosc,04,,,040130000B1801,,,,,,,,,,,,,0,,,,,S,sols,,,175,5.995358,44.114371
2021-43497,2021-07-29,000001,Vente,292500,,,LES FILLIERES,B021,04200,04013,Aubignosc,04,,,040130000B1805,,,,,,,,,,,,,0,,,,,VE,vergers,,,287,5.995149,44.114127
2021-44244,2021-09-29,000001,Vente,170015,180,,MTE DU CHATEAU,0094,04200,04013,Aubignosc,04,,,040130000B1181,,,,,,,,,,,,,0,1,Maison,129,4,S,sols,,,847,,
2021-44244,2021-09-29,000001,Vente,170015,180,,MTE DU CHATEAU,0094,04200,04013,Aubignosc,04,,,040130000B1181,,,,,,,,,,,,,0,3,Dépendance,,0,S,sols,,,847,,
2021-44305,2021-09-21,000001,Vente,23900,,,LE DESSOUS DE LA ROUTE,B016,04200,04013,Aubignosc,04,,,04013000ZA0098,,,,,,,,,,,,,0,,,,,VI,vignes,,,1943,5.978588,44.130638
2021-44305,2021-09-21,000001,Vente,23900,,,LE DESSOUS DE LA ROUTE,B016,04200,04013,Aubignosc,04,,,04013000ZA0098,,,,,,,,,,,,,0,,,,,T,terres,,,1931,5.978588,44.130638
2021-45078,2021-11-04,000001,Vente,40750,,,LES ROUVIERES,B054,04200,04013,Aubignosc,04,,,040130000B0901,,,,,,,,,,,,,0,,,,,T,terres,,,1326,5.993843,44.11353
2021-45078,2021-11-04,000001,Vente,40750,,,LES ROUVIERES,B054,04200,04013,Aubignosc,04,,,040130000B0901,,,,,,,,,,,,,0,,,,,BT,taillis simples,,,480,5.993843,44.11353
2021-45078,2021-11-04,000001,Vente,40750,,,LES ROUVIERES,B054,04200,04013,Aubignosc,04,,,040130000B0902,,,,,,,,,,,,,0,,,,,VI,vignes,,,2800,5.992923,44.113107
2021-45078,2021-11-04,000001,Vente,40750,,,LES ROUVIERES,B054,04200,04013,Aubignosc,04,,,040130000B0902,,,,,,,,,,,,,0,,,,,T,terres,,,1350,5.992923,44.113107
2021-45078,2021-11-04,000001,Vente,40750,,,LES ROUVIERES,B054,04200,04013,Aubignosc,04,,,040130000B0906,,,,,,,,,,,,,0,,,,,T,terres,,,1100,5.992307,44.115018
2021-45078,2021-11-04,000001,Vente,40750,,,LES ROUVIERES,B054,04200,04013,Aubignosc,04,,,040130000B0907,,,,,,,,,,,,,0,,,,,T,terres,,,10996,5.991114,44.115342
2021-45078,2021-11-04,000001,Vente,40750,,,LES ROUVIERES,B054,04200,04013,Aubignosc,04,,,040130000B0908,,,,,,,,,,,,,0,,,,,T,terres,,,4760,5.990129,44.11546
2021-45078,2021-11-04,000001,Vente,40750,,,LES ROUVIERES,B054,04200,04013,Aubignosc,04,,,040130000B1465,,,,,,,,,,,,,0,,,,,T,terres,,,6534,5.989302,44.11149
2021-45078,2021-11-04,000001,Vente,40750,,,LES ROUVIERES,B054,04200,04013,Aubignosc,04,,,040130000B1958,,,,,,,,,,,,,0,,,,,T,terres,,,7723,5.991046,44.112317
2021-45078,2021-11-04,000001,Vente,40750,,,LES ROUVIERES,B054,04200,04013,Aubignosc,04,,,040130000B2008,,,,,,,,,,,,,0,,,,,T,terres,,,2292,5.99327,44.113756
2021-45078,2021-11-04,000001,Vente,40750,,,LES ROUVIERES,B054,04200,04013,Aubignosc,04,,,040130000B2009,,,,,,,,,,,,,0,,,,,T,terres,,,8097,5.992538,44.113413
2021-45078,2021-11-04,000001,Vente,40750,,,LES ROUVIERES,B054,04200,04013,Aubignosc,04,,,040130000B2011,,,,,,,,,,,,,0,,,,,T,terres,,,25167,5.991832,44.114462
2021-45078,2021-11-04,000001,Vente,40750,,,LES ROUVIERES,B054,04200,04013,Aubignosc,04,,,040130000B2013,,,,,,,,,,,,,0,,,,,T,terres,,,664,5.99349,44.113979
2021-45463,2021-12-10,000001,Vente,830,,,LES AMARINES,B001,04200,04013,Aubignosc,04,,,04013000ZA0593,,,,,,,,,,,,,0,,,,,L,landes,,,9,5.97524,44.126472
2021-45463,2021-12-10,000001,Vente,830,,,LES AMARINES,B001,04200,04013,Aubignosc,04,,,04013000ZA0598,,,,,,,,,,,,,0,,,,,T,terres,,,74,5.975122,44.12654
2021-45498,2021-12-13,000001,Vente,285400,,,LE VILLAGE,B068,04200,04013,Aubignosc,04,,,040130000B1305,,,,,,,,,,,,,0,,,,,T,terres,,,52,5.968509,44.130259
2021-45498,2021-12-13,000001,Vente,285400,105,,RTE DE L EGLISE,0104,04200,04013,Aubignosc,04,,,040130000B1306,,,,,,,,,,,,,0,1,Maison,111,4,T,terres,,,1098,5.968063,44.13022
2021-45498,2021-12-13,000001,Vente,285400,105,,RTE DE L EGLISE,0104,04200,04013,Aubignosc,04,,,040130000B1306,,,,,,,,,,,,,0,1,Maison,111,4,S,sols,,,1000,5.968063,44.13022
2021-45686,2021-12-04,000001,Vente,396935,1166,,RTE DU PLATEAU,0010,04200,04013,Aubignosc,04,,,040130000B1255,,,,,,,,,,,,,0,3,Dépendance,,0,S,sols,,,1941,5.988529,44.117865
2021-45686,2021-12-04,000001,Vente,396935,1166,,RTE DU PLATEAU,0010,04200,04013,Aubignosc,04,,,040130000B1255,,,,,,,,,,,,,0,3,Dépendance,,0,S,sols,,,1941,5.988529,44.117865
2021-45686,2021-12-04,000001,Vente,396935,1166,,RTE DU PLATEAU,0010,04200,04013,Aubignosc,04,,,040130000B1255,,,,,,,,,,,,,0,1,Maison,140,5,S,sols,,,1941,5.988529,44.117865
2021-45686,2021-12-04,000001,Vente,396935,1166,,RTE DU PLATEAU,0010,04200,04013,Aubignosc,04,,,040130000B1255,,,,,,,,,,,,,0,3,Dépendance,,0,S,sols,,,1941,5.988529,44.117865
2021-45686,2021-12-04,000001,Vente,396935,1166,,RTE DU PLATEAU,0010,04200,04013,Aubignosc,04,,,040130000B1255,,,,,,,,,,,,,0,3,Dépendance,,0,S,sols,,,1941,5.988529,44.117865
2021-45686,2021-12-04,000001,Vente,396935,1166,,RTE DU PLATEAU,0010,04200,04013,Aubignosc,04,,,040130000B1255,,,,,,,,,,,,,0,3,Dépendance,,0,S,sols,,,1941,5.988529,44.117865
2021-45686,2021-12-04,000001,Vente,396935,,,LES ROUVIERES,B054,04200,04013,Aubignosc,04,,,040130000B1261,,,,,,,,,,,,,0,,,,,L,landes,,,539,5.988341,44.117728
2021-45709,2021-12-17,000001,Vente,50800,,,LURGIEN,B036,04200,04013,Aubignosc,04,,,040130000B0050,,,,,,,,,,,,,0,,,,,AB,terrains a bâtir,,,562,5.954155,44.121415
2021-45996,2021-12-22,000001,Vente,167500,67,,IMP CHAMP GIRARD,0091,04200,04013,Aubignosc,04,,,04013000ZA0584,,,,,,,,,,,,,0,1,Maison,79,4,AB,terrains a bâtir,,,316,5.969262,44.130726
