id_mutation,date_mutation,numero_disposition,nature_mutation,valeur_fonciere,adresse_numero,adresse_suffixe,adresse_nom_voie,adresse_code_voie,code_postal,code_commune,nom_commune,code_departement,ancien_code_commune,ancien_nom_commune,id_parcelle,ancien_id_parcelle,numero_volume,lot1_numero,lot1_surface_carrez,lot2_numero,lot2_surface_carrez,lot3_numero,lot3_surface_carrez,lot4_numero,lot4_surface_carrez,lot5_numero,lot5_surface_carrez,nombre_lots,code_type_local,type_local,surface_reelle_bati,nombre_pieces_principales,code_nature_culture,nature_culture,code_nature_culture_speciale,nature_culture_speciale,surface_terrain,longitude,latitude
2021-47204,2021-03-03,000001,Vente,25000,5011,,LE CHEF LIEU,B084,05100,05027,Cervières,05,,,05027000AC0030,,,38,14.7,,,,,,,,,1,2,Appartement,15,1,,,,,,6.722326,44.868553
2021-47389,2021-03-19,000002,Vente,79.5,,,LE PLAN,B286,05100,05027,Cervières,05,,,050270000G1016,,,,,,,,,,,,,0,,,,,P,prés,,,53,6.739418,44.847764
2021-47691,2021-04-01,000001,Vente,6000,,,LA ROUTE,B328,05100,05027,Cervières,05,,,050270000H0036,,,,,,,,,,,,,0,,,,,P,prés,,,138,6.727011,44.854422
2021-47691,2021-04-01,000001,Vente,6000,,,LA ROUTE,B328,05100,05027,Cervières,05,,,050270000H0042,,,,,,,,,,,,,0,,,,,S,sols,,,94,6.726889,44.854182
2021-48006,2021-04-22,000001,Vente,500,,,PRE DU SAUZE,B305,05100,05027,Cervières,05,,,05027000AC0378,,,,,,,,,,,,,0,,,,,P,prés,,,367,6.721901,44.866171
2021-48419,2021-05-20,000001,Vente,33900,,,LES OCHES DU PIED,B256,05100,05027,Cervières,05,,,05027000AB0229,,,,,,,,,,,,,0,,,,,P,prés,,,452,6.719556,44.869085
2021-48477,2021-05-26,000001,Vente,30500,5011,,LE CHEF LIEU,B084,05100,05027,Cervières,05,,,05027000AC0030,,,41,22.7,,,,,,,,,1,2,Appartement,24,1,,,,,,6.722326,44.868553
2021-48477,2021-05-26,000001,Vente,30500,5011,,LE CHEF LIEU,B084,05100,05027,Cervières,05,,,05027000AC0030,,,59,,,,,,,,,,1,3,Dépendance,,0,,,,,,6.722326,44.868553
2021-50006,2021-07-27,000001,Echange,750.3,,,TERRE ROUGE,B361,05100,05027,Cervières,05,,,050270000H0672,,,,,,,,,,,,,0,,,,,L,landes,,,305,6.689323,44.874975
2021-50007,2021-07-27,000002,Echange,750,,,TERRE ROUGE,B361,05100,05027,Cervières,05,,,050270000H0695,,,,,,,,,,,,,0,,,,,BR,futaies résineuses,,,190,6.689771,44.874296
2021-50007,2021-07-27,000002,Echange,750,,,TERRE ROUGE,B361,05100,05027,Cervières,05,,,050270000H0696,,,,,,,,,,,,,0,,,,,L,landes,,,60,6.689635,44.874255
2021-50732,2021-09-13,000001,Vente,82.5,,,TERRE ROUGE,B361,05100,05027,Cervières,05,,,050270000H0612,,,,,,,,,,,,,0,,,,,L,landes,,,33,6.687595,44.87511
2021-50744,2021-09-13,000002,Vente,317.5,,,LE VALLIN,B372,05100,05027,Cervières,05,,,050270000H1136,,,,,,,,,,,,,0,,,,,P,prés,,,127,6.726683,44.856421
2021-52730,2021-12-09,000001,Vente,88000,5054,,LE CHEF LIEU,B084,05100,05027,Cervières,05,,,05027000AB0170,,,,,,,,,,,,,0,2,Appartement,36,1,S,sols,,,1020,6.720459,44.869965
2021-52730,2021-12-09,000001,Vente,88000,5054,,LE CHEF LIEU,B084,05100,05027,Cervières,05,,,05027000AB0170,,,,,,,,,,,,,0,2,Appartement,36,1,S,sols,,,1020,6.720459,44.869965
2021-52730,2021-12-09,000001,Vente,88000,5054,,LE CHEF LIEU,B084,05100,05027,Cervières,05,,,05027000AB0170,,,,,,,,,,,,,0,3,Dépendance,,0,S,sols,,,1020,6.720459,44.869965
2021-52730,2021-12-09,000001,Vente,88000,5054,,LE CHEF LIEU,B084,05100,05027,Cervières,05,,,05027000AB0170,,,,,,,,,,,,,0,3,Dépendance,,0,S,sols,,,1020,6.720459,44.869965
2021-52730,2021-12-09,000001,Vente,88000,5054,,LE CHEF LIEU,B084,05100,05027,Cervières,05,,,05027000AB0170,,,,,,,,,,,,,0,3,Dépendance,,0,S,sols,,,1020,6.720459,44.869965
