id_mutation,date_mutation,numero_disposition,nature_mutation,valeur_fonciere,adresse_numero,adresse_suffixe,adresse_nom_voie,adresse_code_voie,code_postal,code_commune,nom_commune,code_departement,ancien_code_commune,ancien_nom_commune,id_parcelle,ancien_id_parcelle,numero_volume,lot1_numero,lot1_surface_carrez,lot2_numero,lot2_surface_carrez,lot3_numero,lot3_surface_carrez,lot4_numero,lot4_surface_carrez,lot5_numero,lot5_surface_carrez,nombre_lots,code_type_local,type_local,surface_reelle_bati,nombre_pieces_principales,code_nature_culture,nature_culture,code_nature_culture_speciale,nature_culture_speciale,surface_terrain,longitude,latitude
2021-46435,2021-01-15,000001,Vente,213000,,,LES ANDRIEUX,B002,05130,05057,Fouillouse,05,,,05057000ZA0140,,,,,,,,,,,,,0,,,,,T,terres,,,386,6.005492,44.462427
2021-46435,2021-01-15,000001,Vente,213000,1539,,RTE DES ANDRIEUX,0025,05130,05057,Fouillouse,05,,,05057000ZA0218,,,,,,,,,,,,,0,2,Appartement,89,4,S,sols,,,594,6.005165,44.462295
2021-46435,2021-01-15,000001,Vente,213000,1539,,RTE DES ANDRIEUX,0025,05130,05057,Fouillouse,05,,,05057000ZA0218,,,,,,,,,,,,,0,2,Appartement,89,3,S,sols,,,594,6.005165,44.462295
2021-46497,2021-01-27,000001,Vente,1,,,LE VILLAGE,B031,05130,05057,Fouillouse,05,,,050570000C0697,,,,,,,,,,,,,0,,,,,S,sols,,,32,6.003865,44.457449
2021-46633,2021-01-27,000001,Vente,60000,50,,PL DES AIRES,0020,05130,05057,Fouillouse,05,,,050570000C0696,,,,,,,,,,,,,0,1,Maison,60,4,S,sols,,,116,6.003933,44.457535
2021-46633,2021-01-27,000001,Vente,60000,,,LE VILLAGE,B031,05130,05057,Fouillouse,05,,,050570000C0931,,,,,,,,,,,,,0,,,,,S,sols,,,10,6.003865,44.457503
2021-46633,2021-01-27,000001,Vente,60000,,,LE VILLAGE,B031,05130,05057,Fouillouse,05,,,050570000C0932,,,,,,,,,,,,,0,,,,,S,sols,,,22,6.003991,44.457543
2021-47269,2021-03-09,000001,Vente,3000,,,LE VILLAGE,B031,05130,05057,Fouillouse,05,,,050570000C0934,,,,,,,,,,,,,0,,,,,L,landes,,,132,6.00431,44.457256
2021-47297,2021-03-09,000001,Vente,8000,,,LE VILLAGE,B031,05130,05057,Fouillouse,05,,,050570000C0933,,,,,,,,,,,,,0,,,,,L,landes,,,419,,
2021-47882,2021-04-28,000001,Vente,360667,300,,RTE DE TALLARD,0220,05130,05057,Fouillouse,05,,,05057000ZB0009,,,,,,,,,,,,,0,3,Dépendance,,0,S,sols,,,1500,6.006052,44.457329
2021-47882,2021-04-28,000001,Vente,360667,300,,RTE DE TALLARD,0220,05130,05057,Fouillouse,05,,,05057000ZB0009,,,,,,,,,,,,,0,3,Dépendance,,0,S,sols,,,1500,6.006052,44.457329
2021-47882,2021-04-28,000001,Vente,360667,300,,RTE DE TALLARD,0220,05130,05057,Fouillouse,05,,,05057000ZB0009,,,,,,,,,,,,,0,1,Maison,110,5,S,sols,,,1500,6.006052,44.457329
2021-47882,2021-04-28,000001,Vente,360667,300,,RTE DE TALLARD,0220,05130,05057,Fouillouse,05,,,05057000ZB0009,,,,,,,,,,,,,0,3,Dépendance,,0,T,terres,,,2480,6.006052,44.457329
2021-47882,2021-04-28,000001,Vente,360667,300,,RTE DE TALLARD,0220,05130,05057,Fouillouse,05,,,05057000ZB0009,,,,,,,,,,,,,0,3,Dépendance,,0,T,terres,,,2480,6.006052,44.457329
2021-47882,2021-04-28,000001,Vente,360667,300,,RTE DE TALLARD,0220,05130,05057,Fouillouse,05,,,05057000ZB0009,,,,,,,,,,,,,0,3,Dépendance,,0,T,terres,,,2480,6.006052,44.457329
2021-47882,2021-04-28,000001,Vente,360667,300,,RTE DE TALLARD,0220,05130,05057,Fouillouse,05,,,05057000ZB0009,,,,,,,,,,,,,0,1,Maison,110,5,T,terres,,,2480,6.006052,44.457329
2021-47882,2021-04-28,000001,Vente,360667,300,,RTE DE TALLARD,0220,05130,05057,Fouillouse,05,,,05057000ZB0009,,,,,,,,,,,,,0,3,Dépendance,,0,S,sols,,,1500,6.006052,44.457329
2021-48816,2021-06-04,000001,Vente,85000,,,LE VILLAGE,B031,05130,05057,Fouillouse,05,,,050570000C0925,,,,,,,,,,,,,0,,,,,S,sols,,,43,6.003376,44.457269
2021-48816,2021-06-04,000001,Vente,85000,,,LES GUERINS,B016,05130,05057,Fouillouse,05,,,05057000ZC0054,,,,,,,,,,,,,0,,,,,T,terres,,,1254,6.002859,44.456936
2021-48816,2021-06-04,000001,Vente,85000,,,LES GUERINS,B016,05130,05057,Fouillouse,05,,,05057000ZC0055,,,,,,,,,,,,,0,,,,,T,terres,,,115,6.003256,44.457189
2021-48950,2021-06-11,000001,Vente,323700,1804,,LOT DES GRANDS PINS,0160,05130,05057,Fouillouse,05,,,05057000ZB0085,,,,,,,,,,,,,0,1,Maison,113,5,S,sols,,,2249,6.013918,44.4543
2021-48950,2021-06-11,000001,Vente,323700,1804,,LOT DES GRANDS PINS,0160,05130,05057,Fouillouse,05,,,05057000ZB0085,,,,,,,,,,,,,0,3,Dépendance,,0,S,sols,,,2249,6.013918,44.4543
2021-48950,2021-06-11,000001,Vente,323700,1804,,LOT DES GRANDS PINS,0160,05130,05057,Fouillouse,05,,,05057000ZB0085,,,,,,,,,,,,,0,3,Dépendance,,0,S,sols,,,2249,6.013918,44.4543
2021-50738,2021-08-27,000001,Vente,4000,,,LES BLACHES,B003,05130,05057,Fouillouse,05,,,050570000A0010,,,,,,,,,,,,,0,,,,,L,landes,,,1768,5.99679,44.452068
2021-50738,2021-08-27,000001,Vente,4000,,,CLOT AMOURIQ,B009,05130,05057,Fouillouse,05,,,050570000C0103,,,,,,,,,,,,,0,,,,,L,landes,,,1360,5.993158,44.456475
2021-50738,2021-08-27,000001,Vente,4000,,,L AMOUR,B001,05130,05057,Fouillouse,05,,,050570000C0117,,,,,,,,,,,,,0,,,,,L,landes,,,18653,5.997927,44.455073
2021-50738,2021-08-27,000001,Vente,4000,,,L AMOUR,B001,05130,05057,Fouillouse,05,,,050570000C0117,,,,,,,,,,,,,0,,,,,L,landes,,,18653,5.997927,44.455073
2021-50738,2021-08-27,000001,Vente,4000,,,LES ESSARTS,B010,05130,05057,Fouillouse,05,,,050570000C0191,,,,,,,,,,,,,0,,,,,BT,taillis simples,,,4572,5.993598,44.464808
2021-50738,2021-08-27,000001,Vente,4000,,,LES ESSARTS,B010,05130,05057,Fouillouse,05,,,050570000C0196,,,,,,,,,,,,,0,,,,,BT,taillis simples,,,15562,5.994617,44.464771
2021-50738,2021-08-27,000001,Vente,4000,,,LES ESSARTS,B010,05130,05057,Fouillouse,05,,,050570000C0851,,,,,,,,,,,,,0,,,,,BT,taillis simples,,,23502,5.993186,44.466016
2021-50738,2021-08-27,000001,Vente,4000,,,CLOT AMOURIQ,B009,05130,05057,Fouillouse,05,,,050570000C0866,,,,,,,,,,,,,0,,,,,L,landes,,,3120,5.993367,44.457718
