id_mutation,date_mutation,numero_disposition,nature_mutation,valeur_fonciere,adresse_numero,adresse_suffixe,adresse_nom_voie,adresse_code_voie,code_postal,code_commune,nom_commune,code_departement,ancien_code_commune,ancien_nom_commune,id_parcelle,ancien_id_parcelle,numero_volume,lot1_numero,lot1_surface_carrez,lot2_numero,lot2_surface_carrez,lot3_numero,lot3_surface_carrez,lot4_numero,lot4_surface_carrez,lot5_numero,lot5_surface_carrez,nombre_lots,code_type_local,type_local,surface_reelle_bati,nombre_pieces_principales,code_nature_culture,nature_culture,code_nature_culture_speciale,nature_culture_speciale,surface_terrain,longitude,latitude
2021-74205,2021-04-08,000001,Vente,120000,,,LE VILLAGE,B159,06140,06148,Tourrettes-sur-Loup,06,,,061480000H0151,,,,,,,,,,,,,0,,,,,J,jardins,POTAG,Jardin potager,340,7.058589,43.717128
2021-74395,2021-04-30,000001,Vente,333000,,,LES BERGUIERES,B016,06140,06148,Tourrettes-sur-Loup,06,,,061480000E1440,,,,,,,,,,,,,0,,,,,S,sols,,,72,7.070958,43.707359
2021-74395,2021-04-30,000001,Vente,333000,5417,A,LES BERGUIERES,B016,06140,06148,Tourrettes-sur-Loup,06,,,061480000E1443,,,,,,,,,,,,,0,1,Maison,60,3,S,sols,,,500,7.070904,43.707595
2021-74395,2021-04-30,000001,Vente,333000,5417,A,LES BERGUIERES,B016,06140,06148,Tourrettes-sur-Loup,06,,,061480000E1443,,,,,,,,,,,,,0,1,Maison,60,3,AG,terrains d'agrément,,,178,7.070904,43.707595
2021-74574,2021-04-12,000001,Vente,350000,146,,RTE DES CABANES,0177,06140,06148,Tourrettes-sur-Loup,06,,,061480000D1238,,,,,,,,,,,,,0,,,,,T,terres,,,50,7.074668,43.724563
2021-74574,2021-04-12,000001,Vente,350000,393,,RTE DES CABANES,0177,06140,06148,Tourrettes-sur-Loup,06,,,061480000D1962,,,,,,,,,,,,,0,3,Dépendance,,0,S,sols,,,382,7.074787,43.724618
2021-74574,2021-04-12,000001,Vente,350000,393,,RTE DES CABANES,0177,06140,06148,Tourrettes-sur-Loup,06,,,061480000D1962,,,,,,,,,,,,,0,1,Maison,69,3,S,sols,,,382,7.074787,43.724618
2021-74574,2021-04-12,000001,Vente,350000,393,,RTE DES CABANES,0177,06140,06148,Tourrettes-sur-Loup,06,,,061480000D1963,,,,,,,,,,,,,0,,,,,S,sols,,,55,7.074736,43.724692
2021-74591,2021-04-12,000001,Vente,505000,60,,RTE DE CAMASSADE,0221,06140,06148,Tourrettes-sur-Loup,06,,,061480000F1096,,,,,,,,,,,,,0,3,Dépendance,,0,AG,terrains d'agrément,,,2000,7.050357,43.706293
2021-74591,2021-04-12,000001,Vente,505000,60,,RTE DE CAMASSADE,0221,06140,06148,Tourrettes-sur-Loup,06,,,061480000F1096,,,,,,,,,,,,,0,1,Maison,160,6,AG,terrains d'agrément,,,2000,7.050357,43.706293
2021-74591,2021-04-12,000001,Vente,505000,60,,RTE DE CAMASSADE,0221,06140,06148,Tourrettes-sur-Loup,06,,,061480000F1096,,,,,,,,,,,,,0,3,Dépendance,,0,S,sols,,,464,7.050357,43.706293
2021-74591,2021-04-12,000001,Vente,505000,60,,RTE DE CAMASSADE,0221,06140,06148,Tourrettes-sur-Loup,06,,,061480000F1096,,,,,,,,,,,,,0,1,Maison,160,6,S,sols,,,464,7.050357,43.706293
2021-74591,2021-04-12,000001,Vente,505000,,,LE ROUCASSET,B132,06140,06148,Tourrettes-sur-Loup,06,,,061480000F1099,,,,,,,,,,,,,0,,,,,AG,terrains d'agrément,,,92,7.050779,43.706211
2021-74704,2021-05-04,000002,Vente,410000,,,LE CHATEAU DES VALETTES,B037,06140,06148,Tourrettes-sur-Loup,06,,,061480000A1986,,,,,,,,,,,,,0,,,,,AB,terrains a bâtir,,,38,7.004136,43.706209
2021-74704,2021-05-04,000002,Vente,410000,,,LE CHATEAU DES VALETTES,B037,06140,06148,Tourrettes-sur-Loup,06,,,061480000A1987,,,,,,,,,,,,,0,,,,,AB,terrains a bâtir,,,74,7.003989,43.70614
2021-74704,2021-05-04,000002,Vente,410000,,,LE CHATEAU DES VALETTES,B037,06140,06148,Tourrettes-sur-Loup,06,,,061480000A1991,,,,,,,,,,,,,0,,,,,BR,futaies résineuses,,,190,7.004104,43.705964
2021-74744,2021-04-29,000001,Vente,572500,2078,,RTE DE LA COLLE,0308,06140,06148,Tourrettes-sur-Loup,06,,,061480000G0541,,,,,,,,,,,,,0,1,Maison,168,5,T,terres,,,72,7.002585,43.702471
2021-74744,2021-04-29,000001,Vente,572500,2078,,RTE DE LA COLLE,0308,06140,06148,Tourrettes-sur-Loup,06,,,061480000G0541,,,,,,,,,,,,,0,3,Dépendance,,0,T,terres,,,72,7.002585,43.702471
2021-74744,2021-04-29,000001,Vente,572500,,,PRA LONG,B120,06140,06148,Tourrettes-sur-Loup,06,,,061480000G0544,,,,,,,,,,,,,0,,,,,T,terres,,,2428,7.002188,43.701849
2021-74847,2021-04-23,000001,Vente,600000,463,,RTE DE COURMETTES,0352,06140,06148,Tourrettes-sur-Loup,06,,,061480000A1418,,,,,,,,,,,,,0,1,Maison,168,5,AG,terrains d'agrément,,,2000,7.015927,43.705926
2021-74847,2021-04-23,000001,Vente,600000,463,,RTE DE COURMETTES,0352,06140,06148,Tourrettes-sur-Loup,06,,,061480000A1418,,,,,,,,,,,,,0,3,Dépendance,,0,AG,terrains d'agrément,,,2000,7.015927,43.705926
2021-74847,2021-04-23,000001,Vente,600000,463,,RTE DE COURMETTES,0352,06140,06148,Tourrettes-sur-Loup,06,,,061480000A1418,,,,,,,,,,,,,0,3,Dépendance,,0,S,sols,,,500,7.015927,43.705926
2021-74847,2021-04-23,000001,Vente,600000,463,,RTE DE COURMETTES,0352,06140,06148,Tourrettes-sur-Loup,06,,,061480000A1418,,,,,,,,,,,,,0,1,Maison,168,5,S,sols,,,500,7.015927,43.705926
2021-75067,2021-04-23,000001,Vente,1123800,,,PLATEAU DE LA MAGDELEINE,B116,06140,06148,Tourrettes-sur-Loup,06,,,061480000E2287,,,,,,,,,,,,,0,,,,,S,sols,,,22,7.071781,43.719887
2021-75067,2021-04-23,000001,Vente,1123800,654,,RTE DE LA MADELEINE,0688,06140,06148,Tourrettes-sur-Loup,06,,,061480000E2430,,,,,,,,,,,,,0,1,Maison,45,2,S,sols,,,770,7.071193,43.720071
2021-75067,2021-04-23,000001,Vente,1123800,,,PLATEAU DE LA MAGDELEINE,B116,06140,06148,Tourrettes-sur-Loup,06,,,061480000E2432,,,,,,,,,,,,,0,,,,,VE,vergers,OLIVE,Oliveraie ou oliviers,218,7.071805,43.71986
2021-75067,2021-04-23,000001,Vente,1123800,654,,RTE DE LA MADELEINE,0688,06140,06148,Tourrettes-sur-Loup,06,,,061480000E2434,,,,,,,,,,,,,0,3,Dépendance,,0,AG,terrains d'agrément,,,1603,7.071488,43.719811
2021-75067,2021-04-23,000001,Vente,1123800,654,,RTE DE LA MADELEINE,0688,06140,06148,Tourrettes-sur-Loup,06,,,061480000E2436,,,,,,,,,,,,,0,1,Maison,220,8,S,sols,,,500,7.071466,43.719906
2021-75067,2021-04-23,000001,Vente,1123800,654,,RTE DE LA MADELEINE,0688,06140,06148,Tourrettes-sur-Loup,06,,,061480000E2436,,,,,,,,,,,,,0,1,Maison,220,8,AG,terrains d'agrément,,,353,7.071466,43.719906
2021-75244,2021-05-25,000001,Vente,607000,5631,,RTE DE GRASSE,0546,06140,06148,Tourrettes-sur-Loup,06,,,061480000A1834,,,,,,,,,,,,,0,1,Maison,147,4,S,sols,,,500,7.010438,43.704567
2021-75244,2021-05-25,000001,Vente,607000,5631,,RTE DE GRASSE,0546,06140,06148,Tourrettes-sur-Loup,06,,,061480000A1834,,,,,,,,,,,,,0,1,Maison,147,4,AG,terrains d'agrément,,,2057,7.010438,43.704567
2021-75269,2021-05-20,000001,Vente,530000,,,LA COMBE DU RAY,B049,06140,06148,Tourrettes-sur-Loup,06,,,061480000E1633,,,,,,,,,,,,,0,,,,,AB,terrains a bâtir,,,213,7.074858,43.721062
2021-75269,2021-05-20,000001,Vente,530000,,,LA COMBE DU RAY,B049,06140,06148,Tourrettes-sur-Loup,06,,,061480000E1636,,,,,,,,,,,,,0,,,,,AB,terrains a bâtir,,,581,7.074692,43.720876
2021-75269,2021-05-20,000001,Vente,530000,1697,B,RTE DE VENCE,1132,06140,06148,Tourrettes-sur-Loup,06,,,061480000E1638,,,,,,,,,,,,,0,1,Maison,166,4,S,sols,,,743,7.074709,43.720768
2021-75284,2021-04-26,000001,Vente,530000,2125,,VTE VIEILLE RTE GRASSE VENCE,0548,06140,06148,Tourrettes-sur-Loup,06,,,061480000G0630,,,,,,,,,,,,,0,3,Dépendance,,0,L,landes,,,950,7.019398,43.701782
2021-75284,2021-04-26,000001,Vente,530000,2125,,VTE VIEILLE RTE GRASSE VENCE,0548,06140,06148,Tourrettes-sur-Loup,06,,,061480000G0630,,,,,,,,,,,,,0,3,Dépendance,,0,S,sols,,,84,7.019398,43.701782
2021-75284,2021-04-26,000001,Vente,530000,2125,,VTE VIEILLE RTE GRASSE VENCE,0548,06140,06148,Tourrettes-sur-Loup,06,,,061480000G0630,,,,,,,,,,,,,0,1,Maison,120,3,S,sols,,,84,7.019398,43.701782
2021-75284,2021-04-26,000001,Vente,530000,2125,,VTE VIEILLE RTE GRASSE VENCE,0548,06140,06148,Tourrettes-sur-Loup,06,,,061480000G0630,,,,,,,,,,,,,0,1,Maison,120,3,L,landes,,,950,7.019398,43.701782
2021-75284,2021-04-26,000001,Vente,530000,2125,,VTE VIEILLE RTE GRASSE VENCE,0548,06140,06148,Tourrettes-sur-Loup,06,,,061480000G0630,,,,,,,,,,,,,0,3,Dépendance,,0,AG,terrains d'agrément,,,1466,7.019398,43.701782
2021-75284,2021-04-26,000001,Vente,530000,2125,,VTE VIEILLE RTE GRASSE VENCE,0548,06140,06148,Tourrettes-sur-Loup,06,,,061480000G0630,,,,,,,,,,,,,0,1,Maison,120,3,AG,terrains d'agrément,,,1466,7.019398,43.701782
2021-75385,2021-04-27,000001,Vente,695000,3493,,RTE DE LA COLLE,0308,06140,06148,Tourrettes-sur-Loup,06,,,061480000G0130,,,,,,,,,,,,,0,3,Dépendance,,0,L,landes,,,2140,7.016803,43.699998
2021-75385,2021-04-27,000001,Vente,695000,3493,,RTE DE LA COLLE,0308,06140,06148,Tourrettes-sur-Loup,06,,,061480000G0472,,,,,,,,,,,,,0,1,Maison,112,4,S,sols,,,182,7.016471,43.699573
2021-75385,2021-04-27,000001,Vente,695000,3493,,RTE DE LA COLLE,0308,06140,06148,Tourrettes-sur-Loup,06,,,061480000G0472,,,,,,,,,,,,,0,1,Maison,112,4,AG,terrains d'agrément,,,2108,7.016471,43.699573
2021-75385,2021-04-27,000001,Vente,695000,3493,,RTE DE LA COLLE,0308,06140,06148,Tourrettes-sur-Loup,06,,,061480000G0472,,,,,,,,,,,,,0,3,Dépendance,,0,AG,terrains d'agrément,,,2108,7.016471,43.699573
2021-75385,2021-04-27,000001,Vente,695000,3493,,RTE DE LA COLLE,0308,06140,06148,Tourrettes-sur-Loup,06,,,061480000G0472,,,,,,,,,,,,,0,1,Maison,112,4,BT,taillis simples,,,3775,7.016471,43.699573
2021-75385,2021-04-27,000001,Vente,695000,3493,,RTE DE LA COLLE,0308,06140,06148,Tourrettes-sur-Loup,06,,,061480000G0472,,,,,,,,,,,,,0,3,Dépendance,,0,BT,taillis simples,,,3775,7.016471,43.699573
2021-75385,2021-04-27,000001,Vente,695000,3493,,RTE DE LA COLLE,0308,06140,06148,Tourrettes-sur-Loup,06,,,061480000G0472,,,,,,,,,,,,,0,3,Dépendance,,0,S,sols,,,182,7.016471,43.699573
2021-75405,2021-05-20,000001,Vente,640000,,,LE CHATEAU DES VALETTES,B037,06140,06148,Tourrettes-sur-Loup,06,,,061480000A0372,,,,,,,,,,,,,0,,,,,S,sols,,,26,7.010614,43.705816
2021-75405,2021-05-20,000001,Vente,640000,,,LE CHATEAU DES VALETTES,B037,06140,06148,Tourrettes-sur-Loup,06,,,061480000A0373,,,,,,,,,,,,,0,,,,,VE,vergers,OLIVE,Oliveraie ou oliviers,2124,7.01035,43.705598
2021-75405,2021-05-20,000001,Vente,640000,,,LE CHATEAU DES VALETTES,B037,06140,06148,Tourrettes-sur-Loup,06,,,061480000A0997,,,,,,,,,,,,,0,,,,,L,landes,,,120,7.010654,43.705792
2021-75405,2021-05-20,000001,Vente,640000,606,,RTE DES VALETTES,1108,06140,06148,Tourrettes-sur-Loup,06,,,061480000A1768,,,,,,,,,,,,,0,1,Maison,195,6,S,sols,,,84,7.010305,43.70565
2021-75405,2021-05-20,000001,Vente,640000,606,,RTE DES VALETTES,1108,06140,06148,Tourrettes-sur-Loup,06,,,061480000A1768,,,,,,,,,,,,,0,3,Dépendance,,0,VE,vergers,OLIVE,Oliveraie ou oliviers,1273,7.010305,43.70565
2021-75405,2021-05-20,000001,Vente,640000,606,,RTE DES VALETTES,1108,06140,06148,Tourrettes-sur-Loup,06,,,061480000A1768,,,,,,,,,,,,,0,1,Maison,195,6,VE,vergers,OLIVE,Oliveraie ou oliviers,1273,7.010305,43.70565
2021-75405,2021-05-20,000001,Vente,640000,606,,RTE DES VALETTES,1108,06140,06148,Tourrettes-sur-Loup,06,,,061480000A1768,,,,,,,,,,,,,0,3,Dépendance,,0,S,sols,,,84,7.010305,43.70565
2021-75646,2021-05-03,000001,Vente,42300,,,LE CLAUS,B041,06140,06148,Tourrettes-sur-Loup,06,,,061480000G0190,,,,,,,,,,,,,0,,,,,L,landes,,,9132,7.011189,43.698364
2021-75973,2021-05-07,000001,Vente,950000,,,LES VALLETTES,B153,06140,06148,Tourrettes-sur-Loup,06,,,061480000A0684,,,,,,,,,,,,,0,,,,,J,jardins,POTAG,Jardin potager,620,6.993672,43.714556
2021-75973,2021-05-07,000001,Vente,950000,2425,,RTE DES VALETTES,1108,06140,06148,Tourrettes-sur-Loup,06,,,061480000A0685,,,,,,,,,,,,,0,1,Maison,159,6,S,sols,,,897,6.994054,43.71459
2021-75973,2021-05-07,000001,Vente,950000,2425,,RTE DES VALETTES,1108,06140,06148,Tourrettes-sur-Loup,06,,,061480000A0685,,,,,,,,,,,,,0,3,Dépendance,,0,S,sols,,,897,6.994054,43.71459
2021-75973,2021-05-07,000001,Vente,950000,,,LES VALLETTES,B153,06140,06148,Tourrettes-sur-Loup,06,,,061480000A1293,,,,,,,,,,,,,0,,,,,J,jardins,,,1895,6.994056,43.714353
2021-75973,2021-05-07,000001,Vente,950000,,,LES VALLETTES,B153,06140,06148,Tourrettes-sur-Loup,06,,,061480000A1953,,,,,,,,,,,,,0,,,,,S,sols,,,32,6.993572,43.714457
2021-76102,2021-05-04,000001,Vente,36000,,,LES VALETTES DE SAINT ANTO,B149,06140,06148,Tourrettes-sur-Loup,06,,,061480000B0337,,,,,,,,,,,,,0,,,,,L,landes,,,4561,7.030438,43.705721
2021-76102,2021-05-04,000001,Vente,36000,,,LES VALETTES DE SAINT ANTO,B149,06140,06148,Tourrettes-sur-Loup,06,,,061480000B0441,,,,,,,,,,,,,0,,,,,BR,futaies résineuses,,,2688,7.029733,43.705949
2021-76150,2021-05-26,000001,Vente,490000,245,,CHE DU TUF,1092,06140,06148,Tourrettes-sur-Loup,06,,,061480000D1851,,,,,,,,,,,,,0,1,Maison,177,4,AG,terrains d'agrément,,,539,7.062614,43.723101
2021-76150,2021-05-26,000001,Vente,490000,245,,CHE DU TUF,1092,06140,06148,Tourrettes-sur-Loup,06,,,061480000D1851,,,,,,,,,,,,,0,1,Maison,177,4,S,sols,,,500,7.062614,43.723101
2021-76150,2021-05-26,000001,Vente,490000,,,LE TUF,B146,06140,06148,Tourrettes-sur-Loup,06,,,061480000D1854,,,,,,,,,,,,,0,,,,,BT,taillis simples,,,250,7.062357,43.723167
2021-76160,2021-05-28,000001,Vente,490000,9,,RUE DU FRENE,0492,06140,06148,Tourrettes-sur-Loup,06,,,061480000H0465,,,,,,,,,,,,,0,1,Maison,50,3,S,sols,,,121,7.057745,43.716213
2021-76166,2021-05-28,000001,Vente,615000,382,,CHE DE LA COMBE,0317,06140,06148,Tourrettes-sur-Loup,06,,,061480000E2092,,,,,,,,,,,,,0,3,Dépendance,,0,S,sols,,,1500,7.077303,43.714195
2021-76166,2021-05-28,000001,Vente,615000,382,,CHE DE LA COMBE,0317,06140,06148,Tourrettes-sur-Loup,06,,,061480000E2092,,,,,,,,,,,,,0,1,Maison,104,4,S,sols,,,1500,7.077303,43.714195
2021-76166,2021-05-28,000001,Vente,615000,382,,CHE DE LA COMBE,0317,06140,06148,Tourrettes-sur-Loup,06,,,061480000E2092,,,,,,,,,,,,,0,3,Dépendance,,0,AG,terrains d'agrément,,,1000,7.077303,43.714195
2021-76166,2021-05-28,000001,Vente,615000,382,,CHE DE LA COMBE,0317,06140,06148,Tourrettes-sur-Loup,06,,,061480000E2092,,,,,,,,,,,,,0,1,Maison,104,4,AG,terrains d'agrément,,,1000,7.077303,43.714195
2021-76241,2021-05-28,000001,Vente,6000,,,SAINT MARTIN,B137,06140,06148,Tourrettes-sur-Loup,06,,,061480000C0265,,,,,,,,,,,,,0,,,,,L,landes,,,489,7.04047,43.713941
2021-76241,2021-05-28,000001,Vente,6000,,,SAINT MARTIN,B137,06140,06148,Tourrettes-sur-Loup,06,,,061480000C0266,,,,,,,,,,,,,0,,,,,T,terres,,,2110,7.040435,43.71352
2021-76241,2021-05-28,000001,Vente,6000,,,PIE LOMBARD,B101,06140,06148,Tourrettes-sur-Loup,06,,,061480000C0409,,,,,,,,,,,,,0,,,,,L,landes,,,719,7.04074,43.713023
2021-76284,2021-05-12,000001,Vente,659850,1990,,RTE DE LA COLLE,0308,06140,06148,Tourrettes-sur-Loup,06,,,061480000G0666,,,,,,,,,,,,,0,3,Dépendance,,0,AG,terrains d'agrément,,,2307,7.001507,43.70323
2021-76284,2021-05-12,000001,Vente,659850,1990,,RTE DE LA COLLE,0308,06140,06148,Tourrettes-sur-Loup,06,,,061480000G0666,,,,,,,,,,,,,0,1,Maison,155,6,S,sols,,,500,7.001507,43.70323
2021-76284,2021-05-12,000001,Vente,659850,1990,,RTE DE LA COLLE,0308,06140,06148,Tourrettes-sur-Loup,06,,,061480000G0666,,,,,,,,,,,,,0,1,Maison,155,6,AG,terrains d'agrément,,,2307,7.001507,43.70323
2021-76284,2021-05-12,000001,Vente,659850,1990,,RTE DE LA COLLE,0308,06140,06148,Tourrettes-sur-Loup,06,,,061480000G0666,,,,,,,,,,,,,0,3,Dépendance,,0,S,sols,,,500,7.001507,43.70323
2021-76300,2021-05-10,000002,Vente,330000,,,LE COUSTA,B052,06140,06148,Tourrettes-sur-Loup,06,,,061480000F1532,,,,,,,,,,,,,0,,,,,L,landes,,,826,7.055604,43.714146
2021-76392,2021-05-17,000001,Vente,205000,,,PLAN BOUISSON NORD,B108,06140,06148,Tourrettes-sur-Loup,06,,,061480000E0942,,,,,,,,,,,,,0,,,,,AB,terrains a bâtir,,,924,7.06367,43.710121
2021-76442,2021-04-29,000001,Vente,172000,8,,RUE DU PAS ES CAS,0846,06140,06148,Tourrettes-sur-Loup,06,,,061480000H0997,,,10,,2,49.06,6,,8,,9,,5,2,Appartement,51,3,,,,,,7.058683,43.715696
2021-76455,2021-04-23,000001,Vente,1545700,601,,RTE DES CABANES,0177,06140,06148,Tourrettes-sur-Loup,06,,,061480000D2125,,,,,,,,,,,,,0,2,Appartement,76,3,AG,terrains d'agrément,,,2955,7.076905,43.726257
2021-76455,2021-04-23,000001,Vente,1545700,601,,RTE DES CABANES,0177,06140,06148,Tourrettes-sur-Loup,06,,,061480000D2125,,,,,,,,,,,,,0,2,Appartement,263,7,AG,terrains d'agrément,,,2955,7.076905,43.726257
2021-76455,2021-04-23,000001,Vente,1545700,601,,RTE DES CABANES,0177,06140,06148,Tourrettes-sur-Loup,06,,,061480000D2125,,,,,,,,,,,,,0,2,Appartement,76,3,S,sols,,,500,7.076905,43.726257
2021-76455,2021-04-23,000001,Vente,1545700,601,,RTE DES CABANES,0177,06140,06148,Tourrettes-sur-Loup,06,,,061480000D2125,,,,,,,,,,,,,0,2,Appartement,263,7,S,sols,,,500,7.076905,43.726257
2021-76455,2021-04-23,000001,Vente,1545700,601,,RTE DES CABANES,0177,06140,06148,Tourrettes-sur-Loup,06,,,061480000D2125,,,,,,,,,,,,,0,3,Dépendance,,0,AG,terrains d'agrément,,,2955,7.076905,43.726257
2021-76455,2021-04-23,000001,Vente,1545700,601,,RTE DES CABANES,0177,06140,06148,Tourrettes-sur-Loup,06,,,061480000D2125,,,,,,,,,,,,,0,3,Dépendance,,0,S,sols,,,500,7.076905,43.726257
2021-76455,2021-04-23,000001,Vente,1545700,600,,RTE DES CABANES,0177,06140,06148,Tourrettes-sur-Loup,06,,,061480000D2131,,,,,,,,,,,,,0,3,Dépendance,,0,BT,taillis simples,,,470,7.077127,43.726477
2021-76481,2021-05-11,000001,Vente,419195,2,,RUE DU SOLEIL,1042,06140,06148,Tourrettes-sur-Loup,06,,,061480000H0369,,,,,,,,,,,,,0,1,Maison,55,4,S,sols,,,22,7.058558,43.715978
2021-76481,2021-05-11,000001,Vente,419195,,,LE VILLAGE,B159,06140,06148,Tourrettes-sur-Loup,06,,,061480000H0370,,,,,,,,,,,,,0,,,,,L,landes,,,29,7.058606,43.715966
2021-76672,2021-06-10,000001,Vente,1065000,,,LES MOULIERES,B091,06140,06148,Tourrettes-sur-Loup,06,,,061480000E1627,,,,,,,,,,,,,0,,,,,S,sols,,,250,7.067615,43.714371
2021-76672,2021-06-10,000001,Vente,1065000,667,,RTE DE PROVENCE,0900,06140,06148,Tourrettes-sur-Loup,06,,,061480000E1674,,,,,,,,,,,,,0,1,Maison,143,5,AG,terrains d'agrément,,,1563,7.067676,43.714374
2021-76672,2021-06-10,000001,Vente,1065000,667,,RTE DE PROVENCE,0900,06140,06148,Tourrettes-sur-Loup,06,,,061480000E1674,,,,,,,,,,,,,0,3,Dépendance,,0,AG,terrains d'agrément,,,1563,7.067676,43.714374
2021-76722,2021-06-03,000001,Vente,275000,28,A,GR GRAND RUE,0535,06140,06148,Tourrettes-sur-Loup,06,,,061480000H0415,,,,,,,,,,,,,0,1,Maison,63,3,L,landes,,,37,7.0584,43.715437
2021-76722,2021-06-03,000001,Vente,275000,,,LE VILLAGE,B159,06140,06148,Tourrettes-sur-Loup,06,,,061480000H0512,,,,,,,,,,,,,0,,,,,L,landes,,,27,7.058438,43.715455
2021-77009,2021-06-15,000001,Vente,460150,747,,CHE DES HTES VALETTES,0563,06140,06148,Tourrettes-sur-Loup,06,,,061480000A0366,,,,,,,,,,,,,0,1,Maison,90,4,L,landes,,,3867,7.008108,43.70619
2021-77009,2021-06-15,000001,Vente,460150,747,,CHE DES HTES VALETTES,0563,06140,06148,Tourrettes-sur-Loup,06,,,061480000A0366,,,,,,,,,,,,,0,3,Dépendance,,0,L,landes,,,3867,7.008108,43.70619
2021-77009,2021-06-15,000001,Vente,460150,747,,CHE DES HTES VALETTES,0563,06140,06148,Tourrettes-sur-Loup,06,,,061480000A0366,,,,,,,,,,,,,0,3,Dépendance,,0,L,landes,,,3867,7.008108,43.70619
2021-77185,2021-06-03,000001,Vente,630000,6020,,SAINT ARNOUX,B135,06140,06148,Tourrettes-sur-Loup,06,,,061480000B0489,,,,,,,,,,,,,0,1,Maison,135,5,L,landes,,,180,7.023341,43.707955
2021-77185,2021-06-03,000001,Vente,630000,,,LES VALETTES DE CLARE,B148,06140,06148,Tourrettes-sur-Loup,06,,,061480000B0490,,,,,,,,,,,,,0,,,,,VE,vergers,OLIVE,Oliveraie ou oliviers,5780,7.0236,43.708174
2021-77185,2021-06-03,000001,Vente,630000,,,LES VALETTES DE CLARE,B148,06140,06148,Tourrettes-sur-Loup,06,,,061480000B0490,,,,,,,,,,,,,0,,,,,AG,terrains d'agrément,,,1000,7.0236,43.708174
2021-77185,2021-06-03,000001,Vente,630000,,,LES VALETTES DE CLARE,B148,06140,06148,Tourrettes-sur-Loup,06,,,061480000B0490,,,,,,,,,,,,,0,,,,,S,sols,,,500,7.0236,43.708174
2021-77185,2021-06-03,000001,Vente,630000,,,LES VALETTES DE CLARE,B148,06140,06148,Tourrettes-sur-Loup,06,,,061480000B0523,,,,,,,,,,,,,0,,,,,L,landes,,,212,7.023172,43.708228
2021-77216,2021-05-25,000001,Vente,620000,,,LA GRETTE,B069,06140,06148,Tourrettes-sur-Loup,06,,,061480000D2455,,,,,,,,,,,,,0,,,,,AB,terrains a bâtir,,,41,7.065615,43.723833
2021-77216,2021-05-25,000001,Vente,620000,,,LA GRETTE,B069,06140,06148,Tourrettes-sur-Loup,06,,,061480000D2456,,,,,,,,,,,,,0,,,,,AB,terrains a bâtir,,,12,7.065342,43.723794
2021-77216,2021-05-25,000001,Vente,620000,,,LA GRETTE,B069,06140,06148,Tourrettes-sur-Loup,06,,,061480000D2457,,,,,,,,,,,,,0,,,,,AB,terrains a bâtir,,,11,7.065144,43.723765
2021-77216,2021-05-25,000001,Vente,620000,,,LA GRETTE,B069,06140,06148,Tourrettes-sur-Loup,06,,,061480000D2470,,,,,,,,,,,,,0,,,,,AB,terrains a bâtir,,,434,7.065202,43.723965
2021-77216,2021-05-25,000001,Vente,620000,,,LA GRETTE,B069,06140,06148,Tourrettes-sur-Loup,06,,,061480000D2471,,,,,,,,,,,,,0,,,,,AB,terrains a bâtir,,,419,7.065673,43.724041
2021-77216,2021-05-25,000001,Vente,620000,,,LA GRETTE,B069,06140,06148,Tourrettes-sur-Loup,06,,,061480000D2474,,,,,,,,,,,,,0,,,,,AB,terrains a bâtir,,,402,7.06519,43.723816
2021-77216,2021-05-25,000001,Vente,620000,,,LA GRETTE,B069,06140,06148,Tourrettes-sur-Loup,06,,,061480000D2475,,,,,,,,,,,,,0,,,,,AB,terrains a bâtir,,,454,7.065717,43.723919
2021-77216,2021-05-25,000001,Vente,620000,,,LA GRETTE,B069,06140,06148,Tourrettes-sur-Loup,06,,,061480000D2483,,,,,,,,,,,,,0,,,,,AB,terrains a bâtir,,,2,7.064992,43.724091
2021-77216,2021-05-25,000001,Vente,620000,,,LA GRETTE,B069,06140,06148,Tourrettes-sur-Loup,06,,,061480000D2488,,,,,,,,,,,,,0,,,,,AB,terrains a bâtir,,,80,7.065115,43.724053
2021-77216,2021-05-25,000001,Vente,620000,,,LA GRETTE,B069,06140,06148,Tourrettes-sur-Loup,06,,,061480000D2490,,,,,,,,,,,,,0,,,,,AB,terrains a bâtir,,,31,7.065586,43.724084
2021-77418,2021-06-16,000001,Vente,534400,,,L AMENDIER,B001,06140,06148,Tourrettes-sur-Loup,06,,,061480000E0884,,,,,,,,,,,,,0,,,,,VE,vergers,OLIVE,Oliveraie ou oliviers,1403,7.064908,43.706135
2021-77418,2021-06-16,000001,Vente,534400,811,,RTE DE PLAN BUISSON,0865,06140,06148,Tourrettes-sur-Loup,06,,,061480000E0886,,,,,,,,,,,,,0,1,Maison,134,5,VE,vergers,OLIVE,Oliveraie ou oliviers,3050,7.065347,43.706504
2021-77418,2021-06-16,000001,Vente,534400,,,L AMENDIER,B001,06140,06148,Tourrettes-sur-Loup,06,,,061480000E0887,,,,,,,,,,,,,0,,,,,T,terres,,,100,7.065485,43.706691
2021-77434,2021-05-07,000001,Vente,1198045,,,LES VALETTES DU LOUP,B150,06140,06148,Tourrettes-sur-Loup,06,,,061480000G0289,,,,,,,,,,,,,0,,,,,VE,vergers,OLIVE,Oliveraie ou oliviers,1229,7.030315,43.704723
2021-77434,2021-05-07,000001,Vente,1198045,1005,,VTE VIEILLE RTE GRASSE VENCE,0548,06140,06148,Tourrettes-sur-Loup,06,,,061480000G0290,,,,,,,,,,,,,0,3,Dépendance,,0,AG,terrains d'agrément,,,3000,7.029483,43.70457
2021-77434,2021-05-07,000001,Vente,1198045,1005,,VTE VIEILLE RTE GRASSE VENCE,0548,06140,06148,Tourrettes-sur-Loup,06,,,061480000G0290,,,,,,,,,,,,,0,1,Maison,212,7,AG,terrains d'agrément,,,3000,7.029483,43.70457
2021-77434,2021-05-07,000001,Vente,1198045,1005,,VTE VIEILLE RTE GRASSE VENCE,0548,06140,06148,Tourrettes-sur-Loup,06,,,061480000G0290,,,,,,,,,,,,,0,3,Dépendance,,0,S,sols,,,580,7.029483,43.70457
2021-77434,2021-05-07,000001,Vente,1198045,1005,,VTE VIEILLE RTE GRASSE VENCE,0548,06140,06148,Tourrettes-sur-Loup,06,,,061480000G0290,,,,,,,,,,,,,0,3,Dépendance,,0,AG,terrains d'agrément,,,3000,7.029483,43.70457
2021-77434,2021-05-07,000001,Vente,1198045,1005,,VTE VIEILLE RTE GRASSE VENCE,0548,06140,06148,Tourrettes-sur-Loup,06,,,061480000G0290,,,,,,,,,,,,,0,1,Maison,212,7,S,sols,,,580,7.029483,43.70457
2021-77434,2021-05-07,000001,Vente,1198045,1005,,VTE VIEILLE RTE GRASSE VENCE,0548,06140,06148,Tourrettes-sur-Loup,06,,,061480000G0290,,,,,,,,,,,,,0,3,Dépendance,,0,S,sols,,,580,7.029483,43.70457
2021-77434,2021-05-07,000001,Vente,1198045,1005,T,VTE VIEILLE RTE GRASSE VENCE,0548,06140,06148,Tourrettes-sur-Loup,06,,,061480000G0291,,,,,,,,,,,,,0,,,,,S,sols,,,25,7.0292,43.704521
2021-77434,2021-05-07,000001,Vente,1198045,,,LES VALETTES DU LOUP,B150,06140,06148,Tourrettes-sur-Loup,06,,,061480000G0292,,,,,,,,,,,,,0,,,,,AG,terrains d'agrément,,,1858,7.030196,43.704464
2021-77522,2021-06-02,000001,Vente,311500,4056,,RTE DE GRASSE,0546,06140,06148,Tourrettes-sur-Loup,06,,,061480000B0879,,,,,,,,,,,,,0,1,Maison,75,3,S,sols,,,475,7.026647,43.707252