id_mutation,date_mutation,numero_disposition,nature_mutation,valeur_fonciere,adresse_numero,adresse_suffixe,adresse_nom_voie,adresse_code_voie,code_postal,code_commune,nom_commune,code_departement,ancien_code_commune,ancien_nom_commune,id_parcelle,ancien_id_parcelle,numero_volume,lot1_numero,lot1_surface_carrez,lot2_numero,lot2_surface_carrez,lot3_numero,lot3_surface_carrez,lot4_numero,lot4_surface_carrez,lot5_numero,lot5_surface_carrez,nombre_lots,code_type_local,type_local,surface_reelle_bati,nombre_pieces_principales,code_nature_culture,nature_culture,code_nature_culture_speciale,nature_culture_speciale,surface_terrain,longitude,latitude
2021-95128,2021-03-23,000001,Vente,88000,5106,,LA BASTIDE,B001,48250,07136,Laveyrune,07,,,071360000C0491,,,,,,,,,,,,,0,1,Maison,86,4,S,sols,,,1000,3.907453,44.594461
2021-95801,2021-05-21,000001,Vente,110000,,,ROGLETON,B030,48250,07136,Laveyrune,07,,,071360000B0011,,,,,,,,,,,,,0,,,,,L,landes,,,695,3.89793,44.613315
2021-95801,2021-05-21,000001,Vente,110000,5046,B,ROGLETON,B030,48250,07136,Laveyrune,07,,,071360000B0012,,,,,,,,,,,,,0,1,Maison,70,4,P,prés,,,1670,3.898897,44.613637
2021-95801,2021-05-21,000001,Vente,110000,5046,B,ROGLETON,B030,48250,07136,Laveyrune,07,,,071360000B0012,,,,,,,,,,,,,0,1,Maison,70,4,S,sols,,,1000,3.898897,44.613637
2021-97008,2021-07-27,000001,Vente,7500,,,LAVEYRUNE,B023,48250,07136,Laveyrune,07,,,071360000A0509,,,,,,,,,,,,,0,,,,,S,sols,,,90,3.89656,44.627537
2021-97008,2021-07-27,000001,Vente,7500,,,LAVEYRUNE,B023,48250,07136,Laveyrune,07,,,071360000A0509,,,,,,,,,,,,,0,,,,,P,prés,,,8154,3.89656,44.627537
2021-97008,2021-07-27,000001,Vente,7500,,,LAVEYRUNE,B023,48250,07136,Laveyrune,07,,,071360000A0512,,,,,,,,,,,,,0,,,,,L,landes,,,61,3.896173,44.628329
2021-97008,2021-07-27,000001,Vente,7500,,,LAVEYRUNE,B023,48250,07136,Laveyrune,07,,,071360000A0513,,,,,,,,,,,,,0,,,,,S,sols,,,165,3.896176,44.628292
2021-97008,2021-07-27,000001,Vente,7500,,,LAVEYRUNE,B023,48250,07136,Laveyrune,07,,,071360000A0520,,,,,,,,,,,,,0,,,,,S,sols,,,145,3.896938,44.627524
