id_mutation,date_mutation,numero_disposition,nature_mutation,valeur_fonciere,adresse_numero,adresse_suffixe,adresse_nom_voie,adresse_code_voie,code_postal,code_commune,nom_commune,code_departement,ancien_code_commune,ancien_nom_commune,id_parcelle,ancien_id_parcelle,numero_volume,lot1_numero,lot1_surface_carrez,lot2_numero,lot2_surface_carrez,lot3_numero,lot3_surface_carrez,lot4_numero,lot4_surface_carrez,lot5_numero,lot5_surface_carrez,nombre_lots,code_type_local,type_local,surface_reelle_bati,nombre_pieces_principales,code_nature_culture,nature_culture,code_nature_culture_speciale,nature_culture_speciale,surface_terrain,longitude,latitude
2021-105004,2021-05-28,000001,Vente,170000,9,,RUE DU 46E RI,0225,08190,08024,Asfeld,08,,,08024000ZO0085,,,,,,,,,,,,,0,1,Maison,85,4,J,jardins,,,514,4.123472,49.468998
2021-105004,2021-05-28,000001,Vente,170000,9,,RUE DU 46E RI,0225,08190,08024,Asfeld,08,,,08024000ZO0085,,,,,,,,,,,,,0,1,Maison,85,4,S,sols,,,400,4.123472,49.468998
2021-105321,2021-05-18,000001,Vente,8000,,,LES BAS LIEUX,B007,08190,08024,Asfeld,08,,,08024000ZK0073,,,,,,,,,,,,,0,,,,,AG,terrains d'agrément,JARD,Jardin d'agrément,1568,4.112684,49.473369
2021-105321,2021-05-18,000001,Vente,8000,,,LES BAS LIEUX,B007,08190,08024,Asfeld,08,,,08024000ZK0074,,,,,,,,,,,,,0,,,,,AG,terrains d'agrément,JARD,Jardin d'agrément,401,4.112853,49.473505
2021-105321,2021-05-18,000001,Vente,8000,,,LES BAS LIEUX,B007,08190,08024,Asfeld,08,,,08024000ZK0080,,,,,,,,,,,,,0,,,,,S,sols,,,532,4.112183,49.472966
2021-105549,2021-06-18,000001,Vente,202200,1,,RUE HARSEFELD,0155,08190,08024,Asfeld,08,,,08024000ZO0128,,,,,,,,,,,,,0,1,Maison,101,4,S,sols,,,733,4.111,49.463556
2021-105556,2021-06-25,000001,Vente,3540,,,LES SARTS,B092,08190,08024,Asfeld,08,,,080240000C0723,,,,,,,,,,,,,0,,,,,BT,taillis simples,,,421,4.140217,49.485319
2021-105556,2021-06-25,000001,Vente,3540,,,LES SARTS,B092,08190,08024,Asfeld,08,,,080240000C0725,,,,,,,,,,,,,0,,,,,BT,taillis simples,,,208,4.14035,49.485418
2021-105556,2021-06-25,000001,Vente,3540,,,DEVANT LES MONTS DE VIGNET,B039,08190,08024,Asfeld,08,,,080240000C1148,,,,,,,,,,,,,0,,,,,BT,taillis simples,,,510,4.132989,49.478923
2021-105812,2021-06-30,000001,Vente,22000,,,LE VILLAGE,B111,08190,08024,Asfeld,08,,,08024000AB0447,,,,,,,,,,,,,0,,,,,AB,terrains a bâtir,,,459,4.116557,49.467383
2021-106057,2021-07-16,000001,Vente,76800,2,,RUE DE LA BARRE,0005,08190,08024,Asfeld,08,,,08024000AC0144,,,,,,,,,,,,,0,3,Dépendance,,0,S,sols,,,290,4.117962,49.470098
2021-106057,2021-07-16,000001,Vente,76800,2,,RUE DE LA BARRE,0005,08190,08024,Asfeld,08,,,08024000AC0144,,,,,,,,,,,,,0,4,Local industriel. commercial ou assimilé,290,0,S,sols,,,290,4.117962,49.470098
2021-106057,2021-07-16,000001,Vente,76800,2,,RUE DE LA BARRE,0005,08190,08024,Asfeld,08,,,08024000AC0144,,,,,,,,,,,,,0,1,Maison,45,3,S,sols,,,290,4.117962,49.470098
2021-106754,2021-08-27,000001,Vente,8415,,,LE VILLAGE,B111,08190,08024,Asfeld,08,,,08024000AB0235,,,,,,,,,,,,,0,,,,,VE,vergers,,,179,4.114123,49.468785
2021-106754,2021-08-27,000001,Vente,8415,,,LE VILLAGE,B111,08190,08024,Asfeld,08,,,08024000AB0355,,,,,,,,,,,,,0,,,,,J,jardins,,,397,4.114487,49.46868
2021-106754,2021-08-27,000001,Vente,8415,,,LE VILLAGE,B111,08190,08024,Asfeld,08,,,08024000AB0450,,,,,,,,,,,,,0,,,,,VE,vergers,,,1107,4.114613,49.468777
2021-106755,2021-08-27,000001,Vente,2475,,,LE VILLAGE,B111,08190,08024,Asfeld,08,,,08024000AB0349,,,,,,,,,,,,,0,,,,,J,jardins,,,198,4.11511,49.468339
2021-106755,2021-08-27,000001,Vente,2475,,,LE VILLAGE,B111,08190,08024,Asfeld,08,,,08024000AB0350,,,,,,,,,,,,,0,,,,,VE,vergers,,,52,4.114967,49.46848
2021-106755,2021-08-27,000001,Vente,2475,,,LE VILLAGE,B111,08190,08024,Asfeld,08,,,08024000AB0451,,,,,,,,,,,,,0,,,,,VE,vergers,,,245,4.114974,49.468563
2021-106974,2021-09-07,000001,Vente,362489.06,,,L EPINE VIGNEUX,B045,08190,08024,Asfeld,08,,,08024000YA0002,,,,,,,,,,,,,0,,,,,T,terres,,,80800,4.0751,49.483366
2021-107126,2021-09-21,000001,Vente,53670,,,BERNAVA,B009,08190,08024,Asfeld,08,,,08024000ZO0331,,,,,,,,,,,,,0,,,,,AB,terrains a bâtir,,,732,4.124944,49.468318
2021-107216,2021-09-23,000001,Vente,45200,,,BERNAVA,B009,08190,08024,Asfeld,08,,,08024000ZO0356,,,,,,,,,,,,,0,,,,,AB,terrains a bâtir,,,612,4.127307,49.468979
2021-107424,2021-10-01,000001,Vente,45480,,,BERNAVA,B009,08190,08024,Asfeld,08,,,08024000ZO0346,,,,,,,,,,,,,0,,,,,AB,terrains a bâtir,,,608,4.125954,49.469034
2021-107503,2021-09-30,000001,Vente,1320000,5,,RUE DU DOCTEUR LANDES,0262,08190,08024,Asfeld,08,,,08024000ZO0287,,,,,,,,,,,,,0,4,Local industriel. commercial ou assimilé,339,0,S,sols,,,1000,4.111299,49.462601
2021-107503,2021-09-30,000001,Vente,1320000,5,,RUE DU DOCTEUR LANDES,0262,08190,08024,Asfeld,08,,,08024000ZO0287,,,,,,,,,,,,,0,4,Local industriel. commercial ou assimilé,339,0,P,prés,,,1873,4.111299,49.462601
2021-107597,2021-09-23,000001,Vente,64000,5,,RUE DU CUL DE SAC,0075,08190,08024,Asfeld,08,,,08024000AC0024,,,,,,,,,,,,,0,1,Maison,96,2,S,sols,,,475,4.117026,49.471221
2021-107597,2021-09-23,000001,Vente,64000,,,LE VILLAGE,B111,08190,08024,Asfeld,08,,,08024000AC0025,,,,,,,,,,,,,0,,,,,J,jardins,,,476,4.116861,49.471269
2021-107686,2021-10-15,000001,Vente,237650,22,,RUE CLAUDE FRANCOIS BIDAL,0072,08190,08024,Asfeld,08,,,08024000ZO0220,,,,,,,,,,,,,0,1,Maison,98,4,S,sols,,,601,4.12318,49.46632
2021-107686,2021-10-15,000001,Vente,237650,,,L ALLEE,B002,08190,08024,Asfeld,08,,,08024000ZO0259,,,,,,,,,,,,,0,,,,,T,terres,,,650,4.123122,49.46613
2021-107692,2021-10-14,000001,Vente,49470,,,BERNAVA,B009,08190,08024,Asfeld,08,,,08024000ZO0336,,,,,,,,,,,,,0,,,,,AB,terrains a bâtir,,,669,4.125154,49.468608
2021-107696,2021-10-15,000001,Vente,33000,6,,RUE DU CUL DE SAC,0075,08190,08024,Asfeld,08,,,08024000AC0034,,,,,,,,,,,,,0,1,Maison,48,3,S,sols,,,316,4.117368,49.471252
2021-107744,2021-10-22,000001,Vente,144000,,,LE VILLAGE,B111,08190,08024,Asfeld,08,,,08024000AB0024,,,,,,,,,,,,,0,,,,,S,sols,,,211,4.114749,49.467369
2021-107744,2021-10-22,000001,Vente,144000,7,,RUE DU PONT DE LA FOLIE,0220,08190,08024,Asfeld,08,,,08024000AB0026,,,,,,,,,,,,,0,1,Maison,52,3,S,sols,,,200,4.114862,49.467325
2021-107744,2021-10-22,000001,Vente,144000,,,LE VILLAGE,B111,08190,08024,Asfeld,08,,,08024000AB0027,,,,,,,,,,,,,0,,,,,S,sols,,,137,4.114878,49.46726
2021-107782,2021-10-21,000001,Vente,1000,,,NINVEAU,B073,08190,08024,Asfeld,08,,,08024000ZH0025,,,,,,,,,,,,,0,,,,,BT,taillis simples,,,3370,4.131048,49.48047
2021-107868,2021-10-05,000001,Vente,15000,,,LE VILLAGE,B111,08190,08024,Asfeld,08,,,08024000AB0381,,,,,,,,,,,,,0,,,,,S,sols,,,23,4.112198,49.467419
2021-107868,2021-10-05,000001,Vente,15000,,,LE CHEMIN DE VIEUX,B029,08190,08024,Asfeld,08,,,08024000ZL0080,,,,,,,,,,,,,0,,,,,BT,taillis simples,,,3200,4.111782,49.467346
2021-107868,2021-10-05,000001,Vente,15000,,,LE CHEMIN DE VIEUX,B029,08190,08024,Asfeld,08,,,08024000ZL0080,,,,,,,,,,,,,0,,,,,T,terres,,,19120,4.111782,49.467346
2021-108040,2021-10-15,000001,Vente,2500,,,LES FOURNIGAUX,B051,08190,08024,Asfeld,08,,,08024000ZM0166,,,,,,,,,,,,,0,,,,,T,terres,,,2205,4.119888,49.474906
2021-108439,2021-11-26,000001,Vente,47790,,,BERNAVA,B009,08190,08024,Asfeld,08,,,08024000ZO0353,,,,,,,,,,,,,0,,,,,AB,terrains a bâtir,,,634,4.126888,49.468836
2021-108727,2021-12-08,000001,Vente,95000,1,,PL DE L EGLISE,0090,08190,08024,Asfeld,08,,,08024000AC0353,,,,,,,,,,,,,0,1,Maison,170,5,S,sols,,,228,4.117828,49.470049
2021-108727,2021-12-08,000001,Vente,95000,1,,PL DE L EGLISE,0090,08190,08024,Asfeld,08,,,08024000AC0353,,,,,,,,,,,,,0,3,Dépendance,,0,S,sols,,,228,4.117828,49.470049
2021-108727,2021-12-08,000001,Vente,95000,1,,PL DE L EGLISE,0090,08190,08024,Asfeld,08,,,08024000AC0353,,,,,,,,,,,,,0,3,Dépendance,,0,S,sols,,,228,4.117828,49.470049
2021-109084,2021-12-21,000001,Vente,285,,,LE VILLAGE,B111,08190,08024,Asfeld,08,,,08024000AC0432,,,,,,,,,,,,,0,,,,,AB,terrains a bâtir,,,113,4.120529,49.467667
2021-109084,2021-12-21,000001,Vente,285,,,LE VILLAGE,B111,08190,08024,Asfeld,08,,,08024000AC0434,,,,,,,,,,,,,0,,,,,AB,terrains a bâtir,,,500,4.120342,49.467652
2021-109087,2021-12-20,000001,Vente,9300,,,LES BAS LIEUX,B007,08190,08024,Asfeld,08,,,08024000ZK0075,,,,,,,,,,,,,0,,,,,AG,terrains d'agrément,JARD,Jardin d'agrément,1397,4.112745,49.47238
2021-109087,2021-12-20,000001,Vente,9300,,,LES BAS LIEUX,B007,08190,08024,Asfeld,08,,,08024000ZK0080,,,,,,,,,,,,,0,,,,,S,sols,,,532,4.112183,49.472966
2021-109095,2021-12-27,000001,Vente,1267,,,NINVEAU,B073,08190,08024,Asfeld,08,,,08024000ZH0027,,,,,,,,,,,,,0,,,,,BT,taillis simples,,,2320,4.131418,49.479634
2021-109099,2021-12-27,000001,Vente,550,,,NINVEAU,B073,08190,08024,Asfeld,08,,,08024000ZH0027,,,,,,,,,,,,,0,,,,,BT,taillis simples,,,2320,4.131418,49.479634
2021-109374,2021-01-12,000001,Vente,37412,,,GLOIE A VIEUX,B056,08190,08024,Asfeld,08,,,08024000ZO0275,,,,,,,,,,,,,0,,,,,AB,terrains a bâtir,,,1301,4.109184,49.462311
2021-109399,2021-01-22,000001,Vente,80000,7,,RUE NEUVE,0210,08190,08024,Asfeld,08,,,08024000AC0181,,,,,,,,,,,,,0,1,Maison,75,3,S,sols,,,280,4.11931,49.469319
2021-109401,2021-01-22,000001,Vente,7400,,,LE VILLAGE,B111,08190,08024,Asfeld,08,,,08024000AB0024,,,,,,,,,,,,,0,,,,,S,sols,,,211,4.114749,49.467369
2021-109403,2021-01-22,000001,Vente,9000,,,LE VILLAGE,B111,08190,08024,Asfeld,08,,,08024000AB0212,,,,,,,,,,,,,0,,,,,T,terres,,,481,4.11442,49.470096
2021-109419,2021-01-21,000001,Vente,48910,,,BERNAVA,B009,08190,08024,Asfeld,08,,,08024000ZO0345,,,,,,,,,,,,,0,,,,,AB,terrains a bâtir,,,661,4.126131,49.468892
2021-109482,2021-02-17,000001,Vente,158000,,,LE VILLAGE,B111,08190,08024,Asfeld,08,,,08024000AB0031,,,,,,,,,,,,,0,,,,,J,jardins,,,448,4.114923,49.467034
2021-109482,2021-02-17,000001,Vente,158000,,,LE VILLAGE,B111,08190,08024,Asfeld,08,,,08024000AB0031,,,,,,,,,,,,,0,,,,,S,sols,,,22,4.114923,49.467034
2021-109482,2021-02-17,000001,Vente,158000,42,,RUE CHANTERAINE,0045,08190,08024,Asfeld,08,,,08024000AB0032,,,,,,,,,,,,,0,1,Maison,65,3,S,sols,,,454,4.115394,49.466885
2021-109536,2021-03-11,000001,Vente,15000,,,LE VILLAGE,B111,08190,08024,Asfeld,08,,,08024000AC0180,,,,,,,,,,,,,0,,,,,S,sols,,,276,4.119153,49.469426
2021-109591,2021-04-02,000001,Vente,160000,,,LE VILLAGE,B111,08190,08024,Asfeld,08,,,08024000AB0311,,,,,,,,,,,,,0,,,,,S,sols,,,227,4.116293,49.467318
2021-109591,2021-04-02,000001,Vente,160000,38,,RUE CHANTERAINE,0045,08190,08024,Asfeld,08,,,08024000AB0445,,,,,,,,,,,,,0,1,Maison,86,4,S,sols,,,506,4.116474,49.467327
2021-109593,2021-04-06,000001,Vente,12327.84,,,LES SARTS,B092,08190,08024,Asfeld,08,,,080240000C0676,,,,,,,,,,,,,0,,,,,BT,taillis simples,,,290,4.137836,49.483814
2021-109593,2021-04-06,000001,Vente,12327.84,,,LES SARTS,B092,08190,08024,Asfeld,08,,,080240000C0697,,,,,,,,,,,,,0,,,,,BT,taillis simples,,,617,4.137352,49.485164
2021-109593,2021-04-06,000001,Vente,12327.84,,,LES SARTS,B092,08190,08024,Asfeld,08,,,080240000C0773,,,,,,,,,,,,,0,,,,,BT,taillis simples,,,548,4.141515,49.483656
2021-109593,2021-04-06,000001,Vente,12327.84,,,LES SARTS,B092,08190,08024,Asfeld,08,,,080240000C0774,,,,,,,,,,,,,0,,,,,BT,taillis simples,,,696,4.141782,49.483567
2021-109593,2021-04-06,000001,Vente,12327.84,,,LES SARTS,B092,08190,08024,Asfeld,08,,,080240000C0776,,,,,,,,,,,,,0,,,,,BT,taillis simples,,,270,4.141325,49.484203
2021-109593,2021-04-06,000001,Vente,12327.84,,,SOUS LES MONTS,B095,08190,08024,Asfeld,08,,,08024000ZC0029,,,,,,,,,,,,,0,,,,,BT,taillis simples,,,2000,4.142409,49.477471
2021-109652,2021-04-28,000001,Vente,135200,6,,RUE DU 46E RI,0225,08190,08024,Asfeld,08,,,08024000ZO0075,,,,,,,,,,,,,0,1,Maison,73,4,J,jardins,,,620,4.122561,49.468935
2021-109652,2021-04-28,000001,Vente,135200,6,,RUE DU 46E RI,0225,08190,08024,Asfeld,08,,,08024000ZO0075,,,,,,,,,,,,,0,1,Maison,73,4,S,sols,,,380,4.122561,49.468935
2021-109674,2021-05-11,000001,Vente,33875,,,GLOIE A VIEUX,B056,08190,08024,Asfeld,08,,,08024000ZO0295,,,,,,,,,,,,,0,,,,,AB,terrains a bâtir,,,1414,4.109238,49.461798
2021-109684,2021-05-17,000001,Vente,18000,,,LES FOURNIGAUX,B051,08190,08024,Asfeld,08,,,08024000ZM0046,,,,,,,,,,,,,0,,,,,T,terres,,,1790,4.119864,49.474283
2021-109684,2021-05-17,000001,Vente,18000,,,LES FOURNIGAUX,B051,08190,08024,Asfeld,08,,,08024000ZM0047,,,,,,,,,,,,,0,,,,,T,terres,,,3130,4.12025,49.474282
