id_mutation,date_mutation,numero_disposition,nature_mutation,valeur_fonciere,adresse_numero,adresse_suffixe,adresse_nom_voie,adresse_code_voie,code_postal,code_commune,nom_commune,code_departement,ancien_code_commune,ancien_nom_commune,id_parcelle,ancien_id_parcelle,numero_volume,lot1_numero,lot1_surface_carrez,lot2_numero,lot2_surface_carrez,lot3_numero,lot3_surface_carrez,lot4_numero,lot4_surface_carrez,lot5_numero,lot5_surface_carrez,nombre_lots,code_type_local,type_local,surface_reelle_bati,nombre_pieces_principales,code_nature_culture,nature_culture,code_nature_culture_speciale,nature_culture_speciale,surface_terrain,longitude,latitude
2021-105242,2021-05-04,000001,Vente,100000,,,VILLAGE DE BRIERES,B052,08400,08082,Brécy-Brières,08,,,08082000AC0056,,,,,,,,,,,,,0,,,,,J,jardins,,,165,4.7396,49.332442
2021-105242,2021-05-04,000001,Vente,100000,18,,RUE DES BRULIS,0035,08400,08082,Brécy-Brières,08,,,08082000AC0057,,,,,,,,,,,,,0,1,Maison,96,4,S,sols,,,885,4.739538,49.332333
2021-105242,2021-05-04,000001,Vente,100000,,,VILLAGE DE BRIERES,B052,08400,08082,Brécy-Brières,08,,,08082000AC0082,,,,,,,,,,,,,0,,,,,J,jardins,,,68,4.739863,49.332392
2021-105242,2021-05-04,000001,Vente,100000,,,VILLAGE DE BRIERES,B052,08400,08082,Brécy-Brières,08,,,08082000AC0084,,,,,,,,,,,,,0,,,,,J,jardins,,,79,4.739641,49.332484
2021-106624,2021-08-03,000001,Vente,100,,,VILLAGE DE BRIERES,B052,08400,08082,Brécy-Brières,08,,,08082000AC0081,,,,,,,,,,,,,0,,,,,J,jardins,,,62,4.739851,49.33244
2021-106624,2021-08-03,000001,Vente,100,,,VILLAGE DE BRIERES,B052,08400,08082,Brécy-Brières,08,,,08082000AC0083,,,,,,,,,,,,,0,,,,,J,jardins,,,37,4.739671,49.332514
2021-108285,2021-11-22,000001,Vente,20820,,,LA PIECE DU TILLEUL,B040,08400,08082,Brécy-Brières,08,,,08082000AB0016,,,,,,,,,,,,,0,,,,,BT,taillis simples,,,23120,4.74858,49.349494
2021-110271,2021-03-19,000001,Vente,87500,1,,RUE DE L'AISNE,0032,08400,08082,Brécy-Brières,08,,,08082000AD0062,,,,,,,,,,,,,0,1,Maison,101,4,S,sols,,,288,4.768056,49.322996
2021-110271,2021-03-19,000001,Vente,87500,,,VILLAGE DE BRECY,B051,08400,08082,Brécy-Brières,08,,,08082000AD0117,,,,,,,,,,,,,0,,,,,P,prés,,,746,4.76795,49.322624
2021-110271,2021-03-19,000001,Vente,87500,,,VILLAGE DE BRECY,B051,08400,08082,Brécy-Brières,08,,,08082000AD0118,,,,,,,,,,,,,0,,,,,P,prés,,,1877,4.768257,49.322886
2021-110271,2021-03-19,000001,Vente,87500,,,VILLAGE DE BRECY,B051,08400,08082,Brécy-Brières,08,,,08082000AD0118,,,,,,,,,,,,,0,,,,,P,prés,,,625,4.768257,49.322886
2021-110271,2021-03-19,000001,Vente,87500,,,VILLAGE DE BRECY,B051,08400,08082,Brécy-Brières,08,,,08082000AD0164,,,,,,,,,,,,,0,,,,,S,sols,,,169,4.767877,49.322543
2021-110271,2021-03-19,000001,Vente,87500,,,VILLAGE DE BRECY,B051,08400,08082,Brécy-Brières,08,,,08082000AD0165,,,,,,,,,,,,,0,,,,,T,terres,,,33,4.767883,49.32246
2021-110357,2021-05-18,000001,Vente,16768,,,LES HERBANNES,B030,08400,08082,Brécy-Brières,08,,,08082000ZD0093,,,,,,,,,,,,,0,,,,,P,prés,,,10050,4.755304,49.338051
2021-110357,2021-05-18,000001,Vente,16768,,,CHEMIN D OLIZY,B008,08400,08082,Brécy-Brières,08,,,08082000ZH0168,,,,,,,,,,,,,0,,,,,T,terres,,,19980,4.783412,49.336341
2021-110357,2021-05-18,000001,Vente,16768,,,CHEMIN D OLIZY,B008,08400,08082,Brécy-Brières,08,,,08082000ZH0168,,,,,,,,,,,,,0,,,,,T,terres,,,4000,4.783412,49.336341
