id_mutation,date_mutation,numero_disposition,nature_mutation,valeur_fonciere,adresse_numero,adresse_suffixe,adresse_nom_voie,adresse_code_voie,code_postal,code_commune,nom_commune,code_departement,ancien_code_commune,ancien_nom_commune,id_parcelle,ancien_id_parcelle,numero_volume,lot1_numero,lot1_surface_carrez,lot2_numero,lot2_surface_carrez,lot3_numero,lot3_surface_carrez,lot4_numero,lot4_surface_carrez,lot5_numero,lot5_surface_carrez,nombre_lots,code_type_local,type_local,surface_reelle_bati,nombre_pieces_principales,code_nature_culture,nature_culture,code_nature_culture_speciale,nature_culture_speciale,surface_terrain,longitude,latitude
2021-105240,2021-05-28,000001,Vente,23000,1,,RUE DE COQUILLARD,0003,08250,08274,Marcq,08,,,08274000AB0285,,,,,,,,,,,,,0,3,Dépendance,,0,S,sols,,,317,4.926808,49.320291
2021-105240,2021-05-28,000001,Vente,23000,1,,RUE DE COQUILLARD,0003,08250,08274,Marcq,08,,,08274000AB0285,,,,,,,,,,,,,0,3,Dépendance,,0,S,sols,,,317,4.926808,49.320291
2021-105240,2021-05-28,000001,Vente,23000,1,,RUE DE COQUILLARD,0003,08250,08274,Marcq,08,,,08274000AB0285,,,,,,,,,,,,,0,1,Maison,28,2,S,sols,,,317,4.926808,49.320291
2021-105240,2021-05-28,000001,Vente,23000,1,,RUE DE COQUILLARD,0003,08250,08274,Marcq,08,,,08274000AB0285,,,,,,,,,,,,,0,3,Dépendance,,0,J,jardins,,,1083,4.926808,49.320291
2021-105240,2021-05-28,000001,Vente,23000,1,,RUE DE COQUILLARD,0003,08250,08274,Marcq,08,,,08274000AB0285,,,,,,,,,,,,,0,3,Dépendance,,0,T,terres,,,252,4.926808,49.320291
2021-105240,2021-05-28,000001,Vente,23000,1,,RUE DE COQUILLARD,0003,08250,08274,Marcq,08,,,08274000AB0285,,,,,,,,,,,,,0,3,Dépendance,,0,T,terres,,,252,4.926808,49.320291
2021-105240,2021-05-28,000001,Vente,23000,1,,RUE DE COQUILLARD,0003,08250,08274,Marcq,08,,,08274000AB0285,,,,,,,,,,,,,0,1,Maison,28,2,J,jardins,,,1083,4.926808,49.320291
2021-105240,2021-05-28,000001,Vente,23000,1,,RUE DE COQUILLARD,0003,08250,08274,Marcq,08,,,08274000AB0285,,,,,,,,,,,,,0,1,Maison,28,2,T,terres,,,252,4.926808,49.320291
2021-105240,2021-05-28,000001,Vente,23000,1,,RUE DE COQUILLARD,0003,08250,08274,Marcq,08,,,08274000AB0285,,,,,,,,,,,,,0,3,Dépendance,,0,J,jardins,,,1083,4.926808,49.320291
2021-105245,2021-05-31,000001,Vente,50000,1,,GARE DE MARCQ,0021,08250,08274,Marcq,08,,,08274000ZB0048,,,,,,,,,,,,,0,1,Maison,45,3,S,sols,,,638,4.93743,49.325707
2021-105245,2021-05-31,000001,Vente,50000,1,,GARE DE MARCQ,0021,08250,08274,Marcq,08,,,08274000ZB0048,,,,,,,,,,,,,0,3,Dépendance,,0,S,sols,,,638,4.93743,49.325707
2021-105245,2021-05-31,000001,Vente,50000,,,LA GARE,B059,08250,08274,Marcq,08,,,08274000ZB0049,,,,,,,,,,,,,0,,,,,VE,vergers,,,1654,4.937707,49.325698
2021-105744,2021-06-30,000001,Vente,1000,,,L HERMITAGE,B074,08250,08274,Marcq,08,,,08274000ZD0012,,,,,,,,,,,,,0,,,,,T,terres,,,3460,4.931728,49.306959
2021-106301,2021-07-19,000001,Vente,80000,2,,RUE DE L EGLISE,0018,08250,08274,Marcq,08,,,08274000AB0198,,,,,,,,,,,,,0,1,Maison,120,4,S,sols,,,1293,4.925256,49.320245
2021-107409,2021-09-29,000001,Vente,28481,,,LE CHAMP LA VACHE,B145,08250,08274,Marcq,08,,,08274000ZH0031,,,,,,,,,,,,,0,,,,,P,prés,,,54950,4.904472,49.3169
2021-107409,2021-09-29,000001,Vente,28481,,,LE CHAMP LA VACHE,B145,08250,08274,Marcq,08,,,08274000ZH0031,,,,,,,,,,,,,0,,,,,P,prés,,,20000,4.904472,49.3169
2021-107968,2021-10-29,000001,Vente,126812,,,LE VILLAGE,B137,08250,08274,Marcq,08,,,08274000AB0057,,,,,,,,,,,,,0,,,,,P,prés,,,1012,4.927941,49.320744
2021-107968,2021-10-29,000001,Vente,126812,,,LE VILLAGE,B137,08250,08274,Marcq,08,,,08274000AB0057,,,,,,,,,,,,,0,,,,,S,sols,,,1000,4.927941,49.320744
2021-107968,2021-10-29,000001,Vente,126812,,,LE CLOS,B143,08250,08274,Marcq,08,,,08274000ZB0001,,,,,,,,,,,,,0,,,,,P,prés,,,44430,4.928953,49.3202
2021-107968,2021-10-29,000001,Vente,126812,,,LE CLOS,B143,08250,08274,Marcq,08,,,08274000ZB0001,,,,,,,,,,,,,0,,,,,S,sols,,,2420,4.928953,49.3202
2021-110232,2021-03-04,000001,Vente,58100,,,LA PRAILETTE,B103,08250,08274,Marcq,08,,,08274000ZB0007,,,,,,,,,,,,,0,,,,,S,sols,,,1500,4.925917,49.321834
2021-110232,2021-03-04,000001,Vente,58100,,,LA PRAILETTE,B103,08250,08274,Marcq,08,,,08274000ZB0068,,,,,,,,,,,,,0,,,,,S,sols,,,2926,4.92619,49.321879
2021-110330,2021-04-30,000001,Vente,155800,,,LE VILLAGE,B137,08250,08274,Marcq,08,,,08274000AB0061,,,,,,,,,,,,,0,,,,,J,jardins,,,655,4.927476,49.320231
2021-110330,2021-04-30,000001,Vente,155800,5105,,RUE DE COQUILLARD,0003,08250,08274,Marcq,08,,,08274000AB0062,,,,,,,,,,,,,0,3,Dépendance,,0,S,sols,,,194,4.927315,49.320105
2021-110330,2021-04-30,000001,Vente,155800,4,,RUE DE COQUILLARD,0003,08250,08274,Marcq,08,,,08274000AB0063,,,,,,,,,,,,,0,1,Maison,121,3,S,sols,,,490,4.927549,49.320074
2021-110330,2021-04-30,000001,Vente,155800,,,LE VILLAGE,B137,08250,08274,Marcq,08,,,08274000AB0226,,,,,,,,,,,,,0,,,,,S,sols,,,106,4.927556,49.320345
