id_mutation,date_mutation,numero_disposition,nature_mutation,valeur_fonciere,adresse_numero,adresse_suffixe,adresse_nom_voie,adresse_code_voie,code_postal,code_commune,nom_commune,code_departement,ancien_code_commune,ancien_nom_commune,id_parcelle,ancien_id_parcelle,numero_volume,lot1_numero,lot1_surface_carrez,lot2_numero,lot2_surface_carrez,lot3_numero,lot3_surface_carrez,lot4_numero,lot4_surface_carrez,lot5_numero,lot5_surface_carrez,nombre_lots,code_type_local,type_local,surface_reelle_bati,nombre_pieces_principales,code_nature_culture,nature_culture,code_nature_culture_speciale,nature_culture_speciale,surface_terrain,longitude,latitude
2021-105060,2021-05-12,000001,Vente,130610,46,,RUE PASTEUR,0480,08330,08491,Vrigne aux Bois,08,,,08491000ZE0035,,,,,,,,,,,,,0,1,Maison,82,3,S,sols,,,260,4.855146,49.73151
2021-105068,2021-04-30,000001,Vente,93361.23,15,,IMP BORIS VIAN,0598,08330,08491,Vrigne aux Bois,08,,,08491000AB0613,,,,,,,,,,,,,0,1,Maison,110,5,S,sols,,,500,4.864074,49.738107
2021-105072,2021-05-20,000001,Vente,84000,65,,RUE D'ARDIN,0022,08330,08491,Vrigne aux Bois,08,,,08491000AC0230,,,,,,,,,,,,,0,4,Local industriel. commercial ou assimilé,,,S,sols,,,552,4.865262,49.742284
2021-105075,2021-05-11,000001,Vente,153000,11,,RUE DES MANISES,0395,08330,08491,Vrigne aux Bois,08,,,08491000ZC0034,,,,,,,,,,,,,0,1,Maison,163,5,S,sols,,,1160,4.86477,49.742741
2021-105264,2021-06-03,000001,Vente,12900,5400,,RUE VICTOR HUGO,0600,08330,08491,Vrigne aux Bois,08,,,08491000AD0145,,,,,,,,,,,,,0,3,Dépendance,,0,S,sols,,,62,4.858935,49.738441
2021-105270,2021-06-11,000001,Vente,149000,54,,RUE PIERRE MALLET,0488,08330,08491,Vrigne aux Bois,08,,,08491000ZE0180,,,,,,,,,,,,,0,1,Maison,88,5,S,sols,,,559,4.859123,49.732591
2021-105323,2021-05-26,000001,Vente,107000,7,,RUE DU QUATORZE JUILLET,0500,08330,08491,Vrigne aux Bois,08,,,08491000AB0018,,,,,,,,,,,,,0,2,Appartement,64,3,S,sols,,,82,4.859992,49.73733
2021-105323,2021-05-26,000001,Vente,107000,7,,RUE DU QUATORZE JUILLET,0500,08330,08491,Vrigne aux Bois,08,,,08491000AB0018,,,,,,,,,,,,,0,2,Appartement,64,3,S,sols,,,82,4.859992,49.73733
2021-105323,2021-05-26,000001,Vente,107000,7,,RUE DU QUATORZE JUILLET,0500,08330,08491,Vrigne aux Bois,08,,,08491000AB0018,,,,,,,,,,,,,0,2,Appartement,64,3,S,sols,,,82,4.859992,49.73733
2021-105323,2021-05-26,000001,Vente,107000,7,,RUE DU QUATORZE JUILLET,0500,08330,08491,Vrigne aux Bois,08,,,08491000AB0018,,,,,,,,,,,,,0,3,Dépendance,,0,S,sols,,,82,4.859992,49.73733
2021-105323,2021-05-26,000001,Vente,107000,7,,RUE DU QUATORZE JUILLET,0500,08330,08491,Vrigne aux Bois,08,,,08491000AB0018,,,,,,,,,,,,,0,3,Dépendance,,0,S,sols,,,82,4.859992,49.73733
2021-105323,2021-05-26,000001,Vente,107000,7,,RUE DU QUATORZE JUILLET,0500,08330,08491,Vrigne aux Bois,08,,,08491000AB0018,,,,,,,,,,,,,0,3,Dépendance,,0,S,sols,,,82,4.859992,49.73733
2021-105324,2021-05-26,000001,Vente,80000,,,RUE LUCIEN SAMPAIX,0565,08330,08491,Vrigne aux Bois,08,,,08491000AH0411,,,,,,,,,,,,,0,,,,,J,jardins,,,1351,4.851733,49.73387
2021-105324,2021-05-26,000001,Vente,80000,40,,RUE LUCIEN SAMPAIX,0565,08330,08491,Vrigne aux Bois,08,,,08491000AH0412,,,,,,,,,,,,,0,3,Dépendance,,0,S,sols,,,228,4.85214,49.733783
2021-105324,2021-05-26,000001,Vente,80000,40,,RUE LUCIEN SAMPAIX,0565,08330,08491,Vrigne aux Bois,08,,,08491000AH0412,,,,,,,,,,,,,0,1,Maison,98,6,J,jardins,,,182,4.85214,49.733783
2021-105324,2021-05-26,000001,Vente,80000,40,,RUE LUCIEN SAMPAIX,0565,08330,08491,Vrigne aux Bois,08,,,08491000AH0412,,,,,,,,,,,,,0,3,Dépendance,,0,J,jardins,,,182,4.85214,49.733783
2021-105324,2021-05-26,000001,Vente,80000,40,,RUE LUCIEN SAMPAIX,0565,08330,08491,Vrigne aux Bois,08,,,08491000AH0412,,,,,,,,,,,,,0,3,Dépendance,,0,J,jardins,,,182,4.85214,49.733783
2021-105324,2021-05-26,000001,Vente,80000,40,,RUE LUCIEN SAMPAIX,0565,08330,08491,Vrigne aux Bois,08,,,08491000AH0412,,,,,,,,,,,,,0,1,Maison,98,6,S,sols,,,228,4.85214,49.733783
2021-105324,2021-05-26,000001,Vente,80000,40,,RUE LUCIEN SAMPAIX,0565,08330,08491,Vrigne aux Bois,08,,,08491000AH0412,,,,,,,,,,,,,0,3,Dépendance,,0,S,sols,,,228,4.85214,49.733783
2021-105781,2021-07-06,000001,Vente,230000,302,,RTE DU HAMEAU DE BRIANCOURT,0711,08350,08491,Vrigne aux Bois,08,,,08491072ZC0060,,,,,,,,,,,,,0,1,Maison,120,5,S,sols,,,1015,4.875561,49.732509
2021-105925,2021-07-09,000001,Vente,120000,,,LE PEILY,B046,08330,08491,Vrigne aux Bois,08,,,08491000AH0677,,,7,,,,,,,,,,1,,,,,S,sols,,,60,4.841099,49.733299
2021-105925,2021-07-09,000001,Vente,120000,29,B,AV DE MEZIERES,0440,08330,08491,Vrigne aux Bois,08,,,08491000AH0677,,,5,113.13,6,,,,,,,,2,1,Maison,110,4,,,,,,4.841099,49.733299
2021-105966,2021-07-12,000001,Vente,70000,12,,RUE DU QUATORZE JUILLET,0500,08330,08491,Vrigne aux Bois,08,,,08491000AD0414,,,,,,,,,,,,,0,3,Dépendance,,0,S,sols,,,290,4.859681,49.737363
2021-105966,2021-07-12,000001,Vente,70000,12,,RUE DU QUATORZE JUILLET,0500,08330,08491,Vrigne aux Bois,08,,,08491000AD0414,,,,,,,,,,,,,0,1,Maison,65,3,S,sols,,,290,4.859681,49.737363
2021-106054,2021-07-13,000001,Vente,222600,44,,RUE DE LA BARRE,0070,08330,08491,Vrigne aux Bois,08,,,08491000ZD0220,,,,,,,,,,,,,0,1,Maison,164,5,S,sols,,,1049,4.868181,49.738802
2021-106154,2021-07-15,000001,Vente,143700,5468,A,RUE GAMBETTA,0200,08330,08491,Vrigne aux Bois,08,,,08491000AD0076,,,,,,,,,,,,,0,1,Maison,34,1,S,sols,,,27,4.855401,49.738226
2021-106154,2021-07-15,000001,Vente,143700,16,,RUE GAMBETTA,0200,08330,08491,Vrigne aux Bois,08,,,08491000AD0077,,,,,,,,,,,,,0,1,Maison,37,2,S,sols,,,70,4.855365,49.738196
2021-106154,2021-07-15,000001,Vente,143700,14,,RUE GAMBETTA,0200,08330,08491,Vrigne aux Bois,08,,,08491000AD0078,,,,,,,,,,,,,0,,,,,S,sols,,,41,4.855235,49.738169
2021-106294,2021-07-20,000001,Vente,27800,50,,RUE PASTEUR,0480,08330,08491,Vrigne aux Bois,08,,,08491000ZE0033,,,,,,,,,,,,,0,1,Maison,39,2,S,sols,,,230,4.855189,49.731178
2021-106375,2021-07-15,000001,Vente,730000,,,LES HAZELLES,B089,08350,08491,Vrigne aux Bois,08,,,08491072AB0129,,,,,,,,,,,,,0,,,,,BR,futaies résineuses,,,1810,4.87937,49.758805
2021-106375,2021-07-15,000001,Vente,730000,,,LE BOIS NININ,B069,08350,08491,Vrigne aux Bois,08,,,084910720C0136,,,,,,,,,,,,,0,,,,,BR,futaies résineuses,,,385120,4.884165,49.756201
2021-106375,2021-07-15,000001,Vente,730000,,,PRES DE LA CLAIRETTE,B098,08350,08491,Vrigne aux Bois,08,,,08491072ZB0066,,,,,,,,,,,,,0,,,,,BR,futaies résineuses,,,680,4.888802,49.753996
2021-106396,2021-07-30,000001,Vente,104900,4,,PL VERTE,0710,08350,08491,Vrigne aux Bois,08,,,08491072AC0362,,,,,,,,,,,,,0,1,Maison,93,3,S,sols,,,391,4.876203,49.754736
2021-106396,2021-07-30,000001,Vente,104900,,,LE VILLAGE DE BOSSEVAL,B102,08350,08491,Vrigne aux Bois,08,,,08491072AC0365,,,,,,,,,,,,,0,,,,,J,jardins,,,322,4.87636,49.754741
2021-106558,2021-07-30,000001,Vente,130380,,,LA VALLEE BERGER,B059,08330,08491,Vrigne aux Bois,08,,,08491000ZE0065,,,,,,,,,,,,,0,,,,,T,terres,,,18263,,
2021-106558,2021-07-30,000001,Vente,130380,,,LA VALLEE BERGER,B059,08330,08491,Vrigne aux Bois,08,,,08491000ZE0065,,,,,,,,,,,,,0,,,,,L,landes,FRICH,Friche,2277,,
2021-106558,2021-07-30,000001,Vente,130380,,,LA VALLEE BERGER,B059,08330,08491,Vrigne aux Bois,08,,,08491000ZE0069,,,,,,,,,,,,,0,,,,,P,prés,,,1190,,
2021-106676,2021-08-16,000001,Vente,140000,16,,RUE JULES FERRY,0182,08330,08491,Vrigne aux Bois,08,,,08491000AB0467,,,,,,,,,,,,,0,1,Maison,100,6,S,sols,,,431,4.861014,49.737908
2021-106987,2021-09-08,000001,Vente,12000,10,,RUE JEAN BAPTISTE CLEMENT,0320,08330,08491,Vrigne aux Bois,08,,,08491000AD0308,,,,,,,,,,,,,0,1,Maison,31,1,S,sols,,,121,4.855596,49.736628
2021-107075,2021-08-26,000001,Vente,80000,15,,RUE PIERRE VIENOT,0490,08330,08491,Vrigne aux Bois,08,,,08491000AH0236,,,,,,,,,,,,,0,1,Maison,49,2,S,sols,,,85,4.849402,49.73271
2021-107075,2021-08-26,000001,Vente,80000,,,RUE PIERRE VIENOT,0490,08330,08491,Vrigne aux Bois,08,,,08491000AH0437,,,,,,,,,,,,,0,,,,,S,sols,,,262,4.849427,49.732689
2021-107429,2021-10-08,000001,Vente,23230,,,LA TERRE AU SOLEIL,B100,08350,08491,Vrigne aux Bois,08,,,08491072ZB0013,,,,,,,,,,,,,0,,,,,P,prés,,,30974,4.881079,49.749204
2021-107429,2021-10-08,000001,Vente,23230,,,LA TERRE AU SOLEIL,B100,08350,08491,Vrigne aux Bois,08,,,08491072ZB0013,,,,,,,,,,,,,0,,,,,P,prés,,,15486,4.881079,49.749204
2021-107438,2021-09-10,000001,Vente,37900,,,LE VILLAGE DE VRIGNE,B060,08330,08491,Vrigne aux Bois,08,,,08491000AD0143,,,,,,,,,,,,,0,,,,,S,sols,,,16,4.859047,49.738469
2021-107438,2021-09-10,000001,Vente,37900,19,,RUE VICTOR HUGO,0600,08330,08491,Vrigne aux Bois,08,,,08491000AD0144,,,,,,,,,,,,,0,3,Dépendance,,0,S,sols,,,68,4.859003,49.738461
2021-107438,2021-09-10,000001,Vente,37900,19,,RUE VICTOR HUGO,0600,08330,08491,Vrigne aux Bois,08,,,08491000AD0144,,,,,,,,,,,,,0,1,Maison,34,3,S,sols,,,68,4.859003,49.738461
2021-107467,2021-09-13,000001,Vente,145500,2,,PL AIME DEPONTHIEU,0510,08330,08491,Vrigne aux Bois,08,,,08491000AD0008,,,,,,,,,,,,,0,1,Maison,156,4,S,sols,,,277,4.851655,49.73668
2021-107467,2021-09-13,000001,Vente,145500,,,LE VILLAGE DE VRIGNE,B060,08330,08491,Vrigne aux Bois,08,,,08491000AD0011,,,,,,,,,,,,,0,,,,,J,jardins,,,592,4.851337,49.737022
2021-107543,2021-09-30,000001,Vente,120500,11,,RUE DE LA BARRE,0070,08330,08491,Vrigne aux Bois,08,,,08491000ZD0158,,,,,,,,,,,,,0,1,Maison,108,5,S,sols,,,449,4.865432,49.740133
2021-107611,2021-09-24,000001,Vente,4000,,,LE VILLAGE DE VRIGNE,B060,08330,08491,Vrigne aux Bois,08,,,08491000AD0372,,,,,,,,,,,,,0,,,,,S,sols,,,12,4.853037,49.735618
2021-107611,2021-09-24,000001,Vente,4000,,,LE VILLAGE DE VRIGNE,B060,08330,08491,Vrigne aux Bois,08,,,08491000AD0786,,,,,,,,,,,,,0,,,,,J,jardins,,,866,4.852944,49.736029
2021-107649,2021-09-22,000001,Vente,73000,20,,RUE GAMBETTA,0200,08330,08491,Vrigne aux Bois,08,,,08491000AD0074,,,,,,,,,,,,,0,1,Maison,90,4,S,sols,,,75,4.855255,49.738289
2021-107827,2021-10-08,000001,Vente,55000,,,LA MARLIERE,B042,08330,08491,Vrigne aux Bois,08,,,08491000AB0305,,,,,,,,,,,,,0,,,,,J,jardins,,,138,4.864675,49.737643
2021-107827,2021-10-08,000001,Vente,55000,,,LA MARLIERE,B042,08330,08491,Vrigne aux Bois,08,,,08491000AB0308,,,,,,,,,,,,,0,,,,,P,prés,,,105,4.864752,49.73737
2021-107827,2021-10-08,000001,Vente,55000,,,LA MARLIERE,B042,08330,08491,Vrigne aux Bois,08,,,08491000AB0322,,,,,,,,,,,,,0,,,,,P,prés,,,1851,4.864219,49.737168
2021-107894,2021-10-29,000001,Vente,167000,16,,AV DE MEZIERES,0440,08330,08491,Vrigne aux Bois,08,,,08491000AH0044,,,,,,,,,,,,,0,2,Appartement,26,2,S,sols,,,348,4.843986,49.733972
2021-107894,2021-10-29,000001,Vente,167000,16,,AV DE MEZIERES,0440,08330,08491,Vrigne aux Bois,08,,,08491000AH0044,,,,,,,,,,,,,0,2,Appartement,41,2,S,sols,,,348,4.843986,49.733972
2021-107894,2021-10-29,000001,Vente,167000,16,,AV DE MEZIERES,0440,08330,08491,Vrigne aux Bois,08,,,08491000AH0044,,,,,,,,,,,,,0,2,Appartement,19,1,S,sols,,,348,4.843986,49.733972
2021-107894,2021-10-29,000001,Vente,167000,16,,AV DE MEZIERES,0440,08330,08491,Vrigne aux Bois,08,,,08491000AH0044,,,,,,,,,,,,,0,2,Appartement,76,2,S,sols,,,348,4.843986,49.733972
2021-107894,2021-10-29,000001,Vente,167000,16,,AV DE MEZIERES,0440,08330,08491,Vrigne aux Bois,08,,,08491000AH0044,,,,,,,,,,,,,0,2,Appartement,55,3,S,sols,,,348,4.843986,49.733972
2021-107894,2021-10-29,000001,Vente,167000,,,TENDRECOURT,B057,08330,08491,Vrigne aux Bois,08,,,08491000AH0528,,,,,,,,,,,,,0,,,,,S,sols,,,28,4.844153,49.733988
2021-108420,2021-11-19,000001,Vente,130000,2,,RUE DE L AVENIR,0701,08350,08491,Vrigne aux Bois,08,,,08491072ZB0112,,,,,,,,,,,,,0,1,Maison,90,4,J,jardins,,,793,4.877727,49.751708
2021-108420,2021-11-19,000001,Vente,130000,2,,RUE DE L AVENIR,0701,08350,08491,Vrigne aux Bois,08,,,08491072ZB0112,,,,,,,,,,,,,0,1,Maison,90,4,S,sols,,,202,4.877727,49.751708
2021-108489,2021-11-16,000001,Vente,55750,38,,RUE EMILE ZOLA,0140,08330,08491,Vrigne aux Bois,08,,,08491000AB0067,,,,,,,,,,,,,0,,,,,J,jardins,,,1015,4.864003,49.737595
2021-108489,2021-11-16,000001,Vente,55750,5686,,RUE EMILE ZOLA,0140,08330,08491,Vrigne aux Bois,08,,,08491000AB0068,,,,,,,,,,,,,0,3,Dépendance,,0,S,sols,,,17,4.863961,49.737611
2021-108807,2021-12-13,000001,Vente,2000,9000,,QUAI DE LA VRIGNE,0680,08330,08491,Vrigne aux Bois,08,,,08491000AD0167,,,,,,,,,,,,,0,3,Dépendance,,0,S,sols,,,60,4.856824,49.737208
2021-108807,2021-12-13,000001,Vente,2000,9000,,QUAI DE LA VRIGNE,0680,08330,08491,Vrigne aux Bois,08,,,08491000AD0167,,,,,,,,,,,,,0,3,Dépendance,,0,S,sols,,,60,4.856824,49.737208
2021-108809,2021-12-16,000001,Vente,150000,,,LE MONTANT DE LA WARENNE,B044,08330,08491,Vrigne aux Bois,08,,,08491000AE0131,,,,,,,,,,,,,0,,,,,S,sols,,,7,4.854514,49.740397
2021-108809,2021-12-16,000001,Vente,150000,5,,RUE JEAN JACQUES ROUSSEAU,0340,08330,08491,Vrigne aux Bois,08,,,08491000AE0132,,,,,,,,,,,,,0,3,Dépendance,,0,S,sols,,,847,4.854799,49.740319
2021-108809,2021-12-16,000001,Vente,150000,5,,RUE JEAN JACQUES ROUSSEAU,0340,08330,08491,Vrigne aux Bois,08,,,08491000AE0132,,,,,,,,,,,,,0,3,Dépendance,,0,S,sols,,,847,4.854799,49.740319
2021-108809,2021-12-16,000001,Vente,150000,5,,RUE JEAN JACQUES ROUSSEAU,0340,08330,08491,Vrigne aux Bois,08,,,08491000AE0132,,,,,,,,,,,,,0,1,Maison,107,5,S,sols,,,847,4.854799,49.740319
2021-108809,2021-12-16,000001,Vente,150000,,,LE MONTANT DE LA WARENNE,B044,08330,08491,Vrigne aux Bois,08,,,08491000AE0134,,,,,,,,,,,,,0,,,,,S,sols,,,30,4.854845,49.740442
2021-108809,2021-12-16,000001,Vente,150000,,,LE MONTANT DE LA WARENNE,B044,08330,08491,Vrigne aux Bois,08,,,08491000AE0134,,,,,,,,,,,,,0,,,,,J,jardins,,,509,4.854845,49.740442
2021-108809,2021-12-16,000001,Vente,150000,,,LE MONTANT DE LA WARENNE,B044,08330,08491,Vrigne aux Bois,08,,,08491000AE0383,,,,,,,,,,,,,0,,,,,J,jardins,,,809,4.854415,49.74055
2021-108862,2021-11-25,000001,Vente,54000,3,,PAS CHANZY,0080,08330,08491,Vrigne aux Bois,08,,,08491000AD0450,,,,,,,,,,,,,0,1,Maison,60,3,S,sols,,,46,4.857073,49.73731
2021-108862,2021-11-25,000001,Vente,54000,,,PAS CHANZY,0080,08330,08491,Vrigne aux Bois,08,,,08491000AD0452,,,,,,,,,,,,,0,,,,,S,sols,,,12,4.856944,49.737176
2021-108893,2021-12-06,000001,Vente,7000,,,LABAU,B040,08330,08491,Vrigne aux Bois,08,,,08491000ZB0015,,,,,,,,,,,,,0,,,,,VE,vergers,,,4160,4.855187,49.749174
2021-108950,2021-12-17,000001,Vente,42000,,,LE VILLAGE DE BOSSEVAL,B102,08350,08491,Vrigne aux Bois,08,,,08491072AC0050,,,,,,,,,,,,,0,,,,,AB,terrains a bâtir,,,958,4.874508,49.75628
2021-108955,2021-12-20,000001,Vente,95100,10,,RUE EMILE ZOLA,0140,08330,08491,Vrigne aux Bois,08,,,08491000AD0279,,,,,,,,,,,,,0,3,Dépendance,,0,S,sols,,,299,4.859817,49.736958
2021-108955,2021-12-20,000001,Vente,95100,10,,RUE EMILE ZOLA,0140,08330,08491,Vrigne aux Bois,08,,,08491000AD0279,,,,,,,,,,,,,0,1,Maison,38,2,S,sols,,,299,4.859817,49.736958
2021-108959,2021-12-15,000001,Vente,123300,27,,RUE JEAN JACQUES ROUSSEAU,0340,08330,08491,Vrigne aux Bois,08,,,08491000ZC0106,,,,,,,,,,,,,0,1,Maison,91,5,S,sols,,,1241,4.856881,49.742454
2021-109004,2021-12-17,000001,Vente,130000,30,,AV DE MEZIERES,0440,08330,08491,Vrigne aux Bois,08,,,08491000AH0033,,,,,,,,,,,,,0,1,Maison,63,3,S,sols,,,63,4.843292,49.733632
2021-109004,2021-12-17,000001,Vente,130000,,,TENDRECOURT,B057,08330,08491,Vrigne aux Bois,08,,,08491000AH0530,,,,,,,,,,,,,0,,,,,J,jardins,,,291,4.843295,49.733773
2021-109015,2021-12-09,000001,Vente,269201,2,,IMP PIERRE VIENOT,0491,08330,08491,Vrigne aux Bois,08,,,08491000AH0270,,,,,,,,,,,,,0,,,,,S,sols,,,700,4.847122,49.731779
2021-109015,2021-12-09,000001,Vente,269201,2,,IMP PIERRE VIENOT,0491,08330,08491,Vrigne aux Bois,08,,,08491000AH0271,,,,,,,,,,,,,0,1,Maison,117,4,S,sols,,,242,4.847265,49.731891
2021-109180,2021-12-22,000001,Vente,32900,25,,RUE VICTOR HUGO,0600,08330,08491,Vrigne aux Bois,08,,,08491000AC0107,,,,,,,,,,,,,0,1,Maison,118,5,S,sols,,,96,4.859177,49.738498
2021-109180,2021-12-22,000001,Vente,32900,25,,RUE VICTOR HUGO,0600,08330,08491,Vrigne aux Bois,08,,,08491000AC0107,,,,,,,,,,,,,0,3,Dépendance,,0,S,sols,,,96,4.859177,49.738498
2021-109209,2021-12-22,000001,Vente,106583,16,,AV ROGER SALENGRO,0560,08330,08491,Vrigne aux Bois,08,,,08491000AH0490,,,,,,,,,,,,,0,1,Maison,81,4,S,sols,,,284,4.848511,49.735867
2021-109324,2021-12-29,000001,Vente,43000,,,LE FOND DE PIERRE,B082,08350,08491,Vrigne aux Bois,08,,,08491072ZC0075,,,,,,,,,,,,,0,,,,,AB,terrains a bâtir,,,1040,4.876278,49.732885
2021-109350,2021-05-07,000001,Vente,90000,9998,,LES AULNES,B005,08330,08491,Vrigne aux Bois,08,,,08491000ZH0192,,,,,,,,,,,,,0,4,Local industriel. commercial ou assimilé,,,S,sols,,,2300,4.844609,49.730066
2021-109723,2021-01-11,000001,Vente,152000,7,,IMP BORIS VIAN,0598,08330,08491,Vrigne aux Bois,08,,,08491000AB0497,,,,,,,,,,,,,0,1,Maison,134,6,S,sols,,,892,4.865069,49.738724
2021-109763,2021-01-15,000001,Vente,33000,3,,PAS CHANZY,0080,08330,08491,Vrigne aux Bois,08,,,08491000AD0450,,,,,,,,,,,,,0,1,Maison,60,3,S,sols,,,46,4.857073,49.73731
2021-109763,2021-01-15,000001,Vente,33000,,,PAS CHANZY,0080,08330,08491,Vrigne aux Bois,08,,,08491000AD0452,,,,,,,,,,,,,0,,,,,S,sols,,,12,4.856944,49.737176
2021-109858,2021-02-18,000001,Vente,153000,5,,RUE JULES FERRY,0182,08330,08491,Vrigne aux Bois,08,,,08491000AB0475,,,,,,,,,,,,,0,1,Maison,109,4,S,sols,,,859,4.861748,49.738648
2021-109864,2021-02-19,000001,Vente,34581,,,PRES DE LA BRECHE,B096,08350,08491,Vrigne aux Bois,08,,,08491072ZB0139,,,,,,,,,,,,,0,,,,,P,prés,,,26974,4.876694,49.744568
2021-109864,2021-02-19,000001,Vente,34581,,,LA HART,B039,08330,08491,Vrigne aux Bois,08,,,08491000ZD0272,,,,,,,,,,,,,0,,,,,P,prés,,,42188,4.87601,49.743885
2021-109868,2021-02-19,000001,Vente,120000,,,LE VILLAGE DE VRIGNE,B060,08330,08491,Vrigne aux Bois,08,,,08491000AD0003,,,,,,,,,,,,,0,,,,,S,sols,,,28,4.850706,49.737193
2021-109868,2021-02-19,000001,Vente,120000,,,LE VILLAGE DE VRIGNE,B060,08330,08491,Vrigne aux Bois,08,,,08491000AD0004,,,,,,,,,,,,,0,,,,,J,jardins,,,507,4.851023,49.736948
2021-109868,2021-02-19,000001,Vente,120000,6,,PL AIME DEPONTHIEU,0510,08330,08491,Vrigne aux Bois,08,,,08491000AD0006,,,,,,,,,,,,,0,4,Local industriel. commercial ou assimilé,10,0,S,sols,,,103,4.851312,49.736656
2021-109868,2021-02-19,000001,Vente,120000,6,,PL AIME DEPONTHIEU,0510,08330,08491,Vrigne aux Bois,08,,,08491000AD0006,,,,,,,,,,,,,0,1,Maison,95,5,S,sols,,,103,4.851312,49.736656
2021-109873,2021-03-01,000001,Vente,165000,2,B,RUE EUGENE MARTIN,0175,08330,08491,Vrigne aux Bois,08,,,08491000AE0463,,,,,,,,,,,,,0,1,Maison,96,5,S,sols,,,499,4.848622,49.73677
2021-109941,2021-04-08,000001,Vente,3500,,,LE MONT,B043,08330,08491,Vrigne aux Bois,08,,,08491000ZA0157,,,,,,,,,,,,,0,,,,,P,prés,,,1666,4.844742,49.735228
2021-109941,2021-04-08,000001,Vente,3500,,,LE MONT,B043,08330,08491,Vrigne aux Bois,08,,,08491000ZA0158,,,,,,,,,,,,,0,,,,,P,prés,,,36,4.844614,49.735768
2021-109941,2021-04-08,000001,Vente,3500,,,RUE HIPPOLYTE TAINE,0312,08330,08491,Vrigne aux Bois,08,,,08491000ZA0159,,,,,,,,,,,,,0,,,,,S,sols,,,277,4.844893,49.736003
2021-109941,2021-04-08,000001,Vente,3500,,,RUE HIPPOLYTE TAINE,0312,08330,08491,Vrigne aux Bois,08,,,08491000ZA0160,,,,,,,,,,,,,0,,,,,S,sols,,,9,4.845026,49.736108
2021-109992,2021-03-30,000001,Vente,100000,19,,AV JEAN JAURES,0360,08330,08491,Vrigne aux Bois,08,,,08491000AD0370,,,,,,,,,,,,,0,1,Maison,185,6,S,sols,,,457,,
2021-109992,2021-03-30,000001,Vente,100000,19,,AV JEAN JAURES,0360,08330,08491,Vrigne aux Bois,08,,,08491000AD0370,,,,,,,,,,,,,0,1,Maison,92,3,S,sols,,,457,,
2021-109992,2021-03-30,000001,Vente,100000,,,LE VILLAGE DE VRIGNE,B060,08330,08491,Vrigne aux Bois,08,,,08491000AD0372,,,,,,,,,,,,,0,,,,,S,sols,,,12,4.853037,49.735618
2021-109992,2021-03-30,000001,Vente,100000,,,LE VILLAGE DE VRIGNE,B060,08330,08491,Vrigne aux Bois,08,,,08491000AD0735,,,,,,,,,,,,,0,,,,,J,jardins,,,1650,,
2021-110011,2021-04-21,000001,Vente,43500,,,LE FOND DE PIERRE,B082,08350,08491,Vrigne aux Bois,08,,,08491072ZC0076,,,,,,,,,,,,,0,,,,,AB,terrains a bâtir,,,1042,4.87638,49.732673
2021-110024,2021-04-22,000001,Vente,40000,6,,RUE JEAN JACQUES ROUSSEAU,0340,08330,08491,Vrigne aux Bois,08,,,08491000AD0777,,,,,,,,,,,,,0,4,Local industriel. commercial ou assimilé,998,0,S,sols,,,163,4.855919,49.739857
2021-110024,2021-04-22,000001,Vente,40000,6,,RUE JEAN JACQUES ROUSSEAU,0340,08330,08491,Vrigne aux Bois,08,,,08491000AD0777,,,,,,,,,,,,,0,2,Appartement,88,5,S,sols,,,163,4.855919,49.739857
2021-110024,2021-04-22,000001,Vente,40000,6,,RUE JEAN JACQUES ROUSSEAU,0340,08330,08491,Vrigne aux Bois,08,,,08491000AD0777,,,,,,,,,,,,,0,4,Local industriel. commercial ou assimilé,1048,0,S,sols,,,163,4.855919,49.739857
2021-110024,2021-04-22,000001,Vente,40000,6,,RUE JEAN JACQUES ROUSSEAU,0340,08330,08491,Vrigne aux Bois,08,,,08491000AD0777,,,,,,,,,,,,,0,2,Appartement,55,3,S,sols,,,163,4.855919,49.739857
2021-110050,2021-04-30,000001,Vente,167000,343,,RUE DE TABARZ,0570,08330,08491,Vrigne aux Bois,08,,,08491000AB0227,,,,,,,,,,,,,0,1,Maison,84,4,S,sols,,,920,4.863962,49.734754
2021-110058,2021-04-23,000001,Vente,54000,,,LA BARRE,B006,08330,08491,Vrigne aux Bois,08,,,08491000AB0603,,,,,,,,,,,,,0,,,,,VE,vergers,,,1963,4.865437,49.739153
2021-110061,2021-04-30,000001,Vente,45450.68,,,LES AULNES,B005,08330,08491,Vrigne aux Bois,08,,,08491000ZH0322,,,,,,,,,,,,,0,,,,,P,prés,,,1850,4.841752,49.726902
2021-110061,2021-04-30,000001,Vente,45450.68,,,LES AULNES,B005,08330,08491,Vrigne aux Bois,08,,,08491000ZH0364,,,,,,,,,,,,,0,,,,,P,prés,,,2048,4.842128,49.726823
2021-110065,2021-04-30,000001,Vente,65000,,,LA FENDERIE,B024,08330,08491,Vrigne aux Bois,08,,,08491000ZE0255,,,,,,,,,,,,,0,,,,,AB,terrains a bâtir,,,1127,4.854992,49.732663
2021-110066,2021-04-23,000001,Vente,28000,52,,RUE JEAN JACQUES ROUSSEAU,0340,08330,08491,Vrigne aux Bois,08,,,08491000ZC0098,,,,,,,,,,,,,0,1,Maison,40,2,S,sols,,,647,4.857415,49.742208
2021-110086,2021-05-15,000001,Vente,3000,,,LE COIN DU BOIS NININ,B075,08350,08491,Vrigne aux Bois,08,,,08491072AB0118,,,,,,,,,,,,,0,,,,,BT,taillis simples,,,2221,4.880632,49.760169
2021-110101,2021-05-18,000001,Vente,160000,21,,RUE PIERRE CURIE,0485,08330,08491,Vrigne aux Bois,08,,,08491000AH0378,,,,,,,,,,,,,0,1,Maison,170,5,S,sols,,,670,4.841934,49.73147
2021-110101,2021-05-18,000001,Vente,160000,21,,RUE PIERRE CURIE,0485,08330,08491,Vrigne aux Bois,08,,,08491000AH0379,,,,,,,,,,,,,0,3,Dépendance,,0,S,sols,,,49,4.84258,49.731479
2021-110101,2021-05-18,000001,Vente,160000,21,,RUE PIERRE CURIE,0485,08330,08491,Vrigne aux Bois,08,,,08491000AH0379,,,,,,,,,,,,,0,3,Dépendance,,0,J,jardins,,,510,4.84258,49.731479
2021-110101,2021-05-18,000001,Vente,160000,21,,RUE PIERRE CURIE,0485,08330,08491,Vrigne aux Bois,08,,,08491000AH0379,,,,,,,,,,,,,0,3,Dépendance,,0,P,prés,,,1751,4.84258,49.731479
2021-110101,2021-05-18,000001,Vente,160000,,,L ATTIGNY,B003,08330,08491,Vrigne aux Bois,08,,,08491000AH0549,,,,,,,,,,,,,0,,,,,CH,chemin de fer,FER,Chemin de fer,534,4.842279,49.731292
2021-110103,2021-05-05,000001,Vente,161500,21,,AV ROGER SALENGRO,0560,08330,08491,Vrigne aux Bois,08,,,08491000AH0449,,,,,,,,,,,,,0,1,Maison,148,6,S,sols,,,145,4.847974,49.735299
2021-110103,2021-05-05,000001,Vente,161500,,,AV ROGER SALENGRO,0560,08330,08491,Vrigne aux Bois,08,,,08491000AH0450,,,,,,,,,,,,,0,,,,,S,sols,,,111,4.848041,49.735253
2021-110115,2021-05-12,000001,Vente,171500,,,LE PREMIER FOND,B050,08330,08491,Vrigne aux Bois,08,,,08491000AB0446,,,,,,,,,,,,,0,,,,,J,jardins,,,218,4.861637,49.736922
2021-110115,2021-05-12,000001,Vente,171500,90,,RUE DE TABARZ,0570,08330,08491,Vrigne aux Bois,08,,,08491000AB0449,,,,,,,,,,,,,0,1,Maison,120,5,S,sols,,,1050,4.861898,49.736748
