id_mutation,date_mutation,numero_disposition,nature_mutation,valeur_fonciere,adresse_numero,adresse_suffixe,adresse_nom_voie,adresse_code_voie,code_postal,code_commune,nom_commune,code_departement,ancien_code_commune,ancien_nom_commune,id_parcelle,ancien_id_parcelle,numero_volume,lot1_numero,lot1_surface_carrez,lot2_numero,lot2_surface_carrez,lot3_numero,lot3_surface_carrez,lot4_numero,lot4_surface_carrez,lot5_numero,lot5_surface_carrez,nombre_lots,code_type_local,type_local,surface_reelle_bati,nombre_pieces_principales,code_nature_culture,nature_culture,code_nature_culture_speciale,nature_culture_speciale,surface_terrain,longitude,latitude
2021-110400,2021-01-15,000001,Vente,119000,3,,RUE DE LA COSTE,0015,09600,09002,Aigues-Vives,09,,,090020000B0568,,,,,,,,,,,,,0,1,Maison,101,4,S,sols,,,127,1.875447,42.996964
2021-110400,2021-01-15,000001,Vente,119000,,,AIGUES-VIVES,B002,09600,09002,Aigues-Vives,09,,,090020000B1051,,,,,,,,,,,,,0,,,,,S,sols,,,73,1.875544,42.996816
2021-110400,2021-01-15,000001,Vente,119000,,,AIGUES-VIVES,B002,09600,09002,Aigues-Vives,09,,,090020000B1051,,,,,,,,,,,,,0,,,,,J,jardins,,,145,1.875544,42.996816
2021-110400,2021-01-15,000001,Vente,119000,,,AIGUES-VIVES,B002,09600,09002,Aigues-Vives,09,,,090020000B1291,,,,,,,,,,,,,0,,,,,S,sols,,,154,1.875357,42.996914
2021-110400,2021-01-15,000001,Vente,119000,,,AIGUES-VIVES,B002,09600,09002,Aigues-Vives,09,,,090020000B1292,,,,,,,,,,,,,0,,,,,S,sols,,,33,1.875268,42.996959
2021-110400,2021-01-15,000001,Vente,119000,,,AIGUES-VIVES,B002,09600,09002,Aigues-Vives,09,,,090020000B1294,,,,,,,,,,,,,0,,,,,S,sols,,,112,1.875584,42.996947
2021-110400,2021-01-15,000001,Vente,119000,,,AIGUES-VIVES,B002,09600,09002,Aigues-Vives,09,,,090020000B1294,,,,,,,,,,,,,0,,,,,J,jardins,,,289,1.875584,42.996947
2021-110400,2021-01-15,000001,Vente,119000,,,AIGUES-VIVES,B002,09600,09002,Aigues-Vives,09,,,090020000B1296,,,,,,,,,,,,,0,,,,,S,sols,,,88,1.875319,42.997049
2021-110400,2021-01-15,000001,Vente,119000,,,AIGUES-VIVES,B002,09600,09002,Aigues-Vives,09,,,090020000B1297,,,,,,,,,,,,,0,,,,,S,sols,,,24,1.875259,42.997034
2021-110400,2021-01-15,000001,Vente,119000,,,AIGUES-VIVES,B002,09600,09002,Aigues-Vives,09,,,090020000B1298,,,,,,,,,,,,,0,,,,,S,sols,,,31,1.875185,42.99709
2021-110843,2021-02-19,000001,Vente,500,,,PRATS D AMOUNT,B013,09600,09002,Aigues-Vives,09,,,090020000B0855,,,,,,,,,,,,,0,,,,,T,terres,,,1232,1.871747,42.988326
2021-110855,2021-02-19,000001,Echange,4000,,,BERNADELS,B019,09600,09002,Aigues-Vives,09,,,090020000A0081,,,,,,,,,,,,,0,,,,,T,terres,,,3132,1.887862,42.995838
2021-110856,2021-02-19,000002,Echange,5500,,,LESTRADE,B007,09600,09002,Aigues-Vives,09,,,090020000A0303,,,,,,,,,,,,,0,,,,,T,terres,,,960,1.882596,42.994939
2021-110856,2021-02-19,000002,Echange,5500,,,LESTRADE,B007,09600,09002,Aigues-Vives,09,,,090020000A0304,,,,,,,,,,,,,0,,,,,T,terres,,,900,1.882724,42.994895
2021-110856,2021-02-19,000002,Echange,5500,,,LESTRADE,B007,09600,09002,Aigues-Vives,09,,,090020000A0305,,,,,,,,,,,,,0,,,,,T,terres,,,2855,1.883095,42.994976
2021-110856,2021-02-19,000002,Echange,5500,,,LESTRADE,B007,09600,09002,Aigues-Vives,09,,,090020000A0306,,,,,,,,,,,,,0,,,,,T,terres,,,5715,1.883272,42.994506
2021-110856,2021-02-19,000002,Echange,5500,,,LESTRADE,B007,09600,09002,Aigues-Vives,09,,,090020000A0308,,,,,,,,,,,,,0,,,,,T,terres,,,1915,1.883816,42.994161
2021-110856,2021-02-19,000002,Echange,5500,,,PRATS D AMOUNT,B013,09600,09002,Aigues-Vives,09,,,090020000B0844,,,,,,,,,,,,,0,,,,,T,terres,,,7120,1.873707,42.989069
2021-110857,2021-02-19,000003,Echange,2500,,,PRATS D AMOUNT,B013,09600,09002,Aigues-Vives,09,,,090020000B0843,,,,,,,,,,,,,0,,,,,T,terres,,,5130,1.872621,42.989486
2021-110857,2021-02-19,000003,Echange,2500,,,PRATS D AMOUNT,B013,09600,09002,Aigues-Vives,09,,,090020000B0845,,,,,,,,,,,,,0,,,,,T,terres,,,3200,1.872597,42.988872
2021-110858,2021-02-19,000004,Echange,4000,,,SEGUELA,B015,09600,09002,Aigues-Vives,09,,,090020000A0236,,,,,,,,,,,,,0,,,,,T,terres,,,2859,1.875783,42.98889
2021-110858,2021-02-19,000004,Echange,4000,,,SEGUELA,B015,09600,09002,Aigues-Vives,09,,,090020000A0237,,,,,,,,,,,,,0,,,,,T,terres,,,2858,1.876246,42.988626
2021-110858,2021-02-19,000004,Echange,4000,,,LA LAOUZO,B005,09600,09002,Aigues-Vives,09,,,090020000B0762,,,,,,,,,,,,,0,,,,,L,landes,,,1416,1.870468,42.996328
2021-110858,2021-02-19,000004,Echange,4000,,,LA LAOUZO,B005,09600,09002,Aigues-Vives,09,,,090020000B0765,,,,,,,,,,,,,0,,,,,P,prés,,,4605,,
2021-110858,2021-02-19,000004,Echange,4000,,,LA LAOUZO,B005,09600,09002,Aigues-Vives,09,,,090020000B0766,,,,,,,,,,,,,0,,,,,P,prés,,,1120,,
2021-110858,2021-02-19,000004,Echange,4000,,,LA LAOUZO,B005,09600,09002,Aigues-Vives,09,,,090020000B0768,,,,,,,,,,,,,0,,,,,P,prés,,,2585,1.870857,42.995665
2021-111801,2021-04-07,000001,Vente,75000,2,,RUE DE LA PAIX,0064,09600,09002,Aigues-Vives,09,,,090020000B0587,,,,,,,,,,,,,0,1,Maison,116,4,S,sols,,,182,1.874968,42.996806
2021-111801,2021-04-07,000001,Vente,75000,,,AIGUES-VIVES,B002,09600,09002,Aigues-Vives,09,,,090020000B1064,,,,,,,,,,,,,0,,,,,S,sols,,,40,1.874995,42.996943
2021-111801,2021-04-07,000001,Vente,75000,,,AIGUES-VIVES,B002,09600,09002,Aigues-Vives,09,,,090020000B1141,,,,,,,,,,,,,0,,,,,S,sols,,,50,1.874968,42.996923
2021-111801,2021-04-07,000001,Vente,75000,71,,AIGUES-VIVES,B002,09600,09002,Aigues-Vives,09,,,090020000B1448,,,,,,,,,,,,,0,1,Maison,56,3,S,sols,,,174,1.874863,42.99684
2021-112206,2021-05-12,000001,Vente,102060,,,AIGUES VIVES,B001,09600,09002,Aigues-Vives,09,,,090020000B1132,,,,,,,,,,,,,0,,,,,S,sols,,,212,1.877935,42.997304
2021-112206,2021-05-12,000001,Vente,102060,,,AIGUES VIVES,B001,09600,09002,Aigues-Vives,09,,,090020000B1132,,,,,,,,,,,,,0,,,,,P,prés,,,8008,1.877935,42.997304
2021-112206,2021-05-12,000001,Vente,102060,,,AIGUES VIVES,B001,09600,09002,Aigues-Vives,09,,,090020000B1133,,,,,,,,,,,,,0,,,,,S,sols,,,1,1.877652,42.996612
2021-112206,2021-05-12,000001,Vente,102060,,,AIGUES VIVES,B001,09600,09002,Aigues-Vives,09,,,090020000B1133,,,,,,,,,,,,,0,,,,,T,terres,,,6359,1.877652,42.996612
2021-112683,2021-06-11,000001,Vente,1500,,,SOULA ET LABORIO,B017,09600,09002,Aigues-Vives,09,,,090020000A0102,,,,,,,,,,,,,0,,,,,T,terres,,,1525,1.882345,43.001278
2021-112683,2021-06-11,000001,Vente,1500,,,SOULA ET LABORIO,B017,09600,09002,Aigues-Vives,09,,,090020000A0103,,,,,,,,,,,,,0,,,,,T,terres,,,1740,1.8825,43.001406
2021-112683,2021-06-11,000001,Vente,1500,,,SOULA ET LABORIO,B017,09600,09002,Aigues-Vives,09,,,090020000A0104,,,,,,,,,,,,,0,,,,,T,terres,,,3340,1.88258,43.001691
2021-112683,2021-06-11,000001,Vente,1500,,,LA LAOUZO,B005,09600,09002,Aigues-Vives,09,,,090020000B0747,,,,,,,,,,,,,0,,,,,P,prés,,,795,1.869868,42.996765
2021-112683,2021-06-11,000001,Vente,1500,,,LA LAOUZO,B005,09600,09002,Aigues-Vives,09,,,090020000B0769,,,,,,,,,,,,,0,,,,,P,prés,,,1030,1.870795,42.995385
2021-112683,2021-06-11,000001,Vente,1500,,,MAGROU,B009,09600,09002,Aigues-Vives,09,,,090020000B0977,,,,,,,,,,,,,0,,,,,P,prés,,,1005,1.86672,42.994911
2021-112683,2021-06-11,000001,Vente,1500,,,MAGROU,B009,09600,09002,Aigues-Vives,09,,,090020000B0986,,,,,,,,,,,,,0,,,,,P,prés,,,1469,1.867648,42.994956
2021-113352,2021-07-16,000001,Vente,3500,,,LA PLANO,B010,09600,09002,Aigues-Vives,09,,,090020000B0084,,,,,,,,,,,,,0,,,,,T,terres,,,4256,1.880764,43.00247
2021-113717,2021-07-16,000001,Vente,195000,20,,CHE DE SAINT ROCH,0081,09600,09002,Aigues-Vives,09,,,090020000A0454,,,,,,,,,,,,,0,1,Maison,92,4,S,sols,,,1410,1.881828,42.998344
2021-113717,2021-07-16,000001,Vente,195000,20,,CHE DE SAINT ROCH,0081,09600,09002,Aigues-Vives,09,,,090020000A0454,,,,,,,,,,,,,0,3,Dépendance,,0,S,sols,,,1410,1.881828,42.998344
2021-113717,2021-07-16,000001,Vente,195000,,,BERNADELS,B019,09600,09002,Aigues-Vives,09,,,090020000A0456,,,,,,,,,,,,,0,,,,,T,terres,,,238,1.881852,42.998494
2021-113859,2021-07-15,000001,Vente,179200,7,,CHE DE TABRE,0089,09600,09002,Aigues-Vives,09,,,090020000B1428,,,,,,,,,,,,,0,3,Dépendance,,0,S,sols,,,735,1.873346,42.993914
2021-113859,2021-07-15,000001,Vente,179200,7,,CHE DE TABRE,0089,09600,09002,Aigues-Vives,09,,,090020000B1428,,,,,,,,,,,,,0,1,Maison,104,5,P,prés,,,961,1.873346,42.993914
2021-113859,2021-07-15,000001,Vente,179200,7,,CHE DE TABRE,0089,09600,09002,Aigues-Vives,09,,,090020000B1428,,,,,,,,,,,,,0,3,Dépendance,,0,P,prés,,,961,1.873346,42.993914
2021-113859,2021-07-15,000001,Vente,179200,7,,CHE DE TABRE,0089,09600,09002,Aigues-Vives,09,,,090020000B1428,,,,,,,,,,,,,0,1,Maison,104,5,S,sols,,,735,1.873346,42.993914
2021-114022,2021-07-26,000001,Vente,1000,,,BERNADELS,B019,09600,09002,Aigues-Vives,09,,,090020000A0084,,,,,,,,,,,,,0,,,,,T,terres,,,1105,1.887184,42.994606
2021-114022,2021-07-26,000001,Vente,1000,,,PRATS D AMOUNT,B013,09600,09002,Aigues-Vives,09,,,090020000B0878,,,,,,,,,,,,,0,,,,,P,prés,,,765,1.866787,42.990676
2021-114022,2021-07-26,000001,Vente,1000,,,MAGROU,B009,09600,09002,Aigues-Vives,09,,,090020000B0952,,,,,,,,,,,,,0,,,,,P,prés,,,3730,1.865072,42.99356
2021-114038,2021-07-27,000001,Vente,500,,,PRATS D AMOUNT,B013,09600,09002,Aigues-Vives,09,,,090020000B0830,,,,,,,,,,,,,0,,,,,T,terres,,,1117,1.876568,42.992303
2021-114048,2021-07-28,000001,Vente,2000,,,SEGUELA,B015,09600,09002,Aigues-Vives,09,,,090020000A0229,,,,,,,,,,,,,0,,,,,T,terres,,,4640,1.874883,42.987959
2021-114048,2021-07-28,000001,Vente,2000,,,SEGUELA,B015,09600,09002,Aigues-Vives,09,,,090020000A0242,,,,,,,,,,,,,0,,,,,T,terres,,,1300,1.877073,42.990159
2021-114486,2021-09-06,000001,Vente,156000,15,,CHE DES PRATS D AMOUNT,0069,09600,09002,Aigues-Vives,09,,,090020000B1690,,,,,,,,,,,,,0,1,Maison,90,4,S,sols,,,1094,1.873606,42.992153
2021-114486,2021-09-06,000001,Vente,156000,15,,CHE DES PRATS D AMOUNT,0069,09600,09002,Aigues-Vives,09,,,090020000B1690,,,,,,,,,,,,,0,3,Dépendance,,0,S,sols,,,1094,1.873606,42.992153
2021-114788,2021-09-27,000001,Vente,214000,7,,RUE GEORGES CLEMENCEAU,0013,09600,09002,Aigues-Vives,09,,,090020000B1307,,,,,,,,,,,,,0,3,Dépendance,,0,S,sols,,,1013,1.876957,42.996141
2021-114788,2021-09-27,000001,Vente,214000,7,,RUE GEORGES CLEMENCEAU,0013,09600,09002,Aigues-Vives,09,,,090020000B1307,,,,,,,,,,,,,0,3,Dépendance,,0,S,sols,,,1013,1.876957,42.996141
2021-114788,2021-09-27,000001,Vente,214000,7,,RUE GEORGES CLEMENCEAU,0013,09600,09002,Aigues-Vives,09,,,090020000B1307,,,,,,,,,,,,,0,1,Maison,99,5,S,sols,,,1013,1.876957,42.996141
2021-114788,2021-09-27,000001,Vente,214000,,,AIGUES-VIVES,B002,09600,09002,Aigues-Vives,09,,,090020000B1505,,,,,,,,,,,,,0,,,,,P,prés,,,1570,1.876803,42.996018
2021-114880,2021-09-24,000001,Vente,500,,,AIGUES-VIVES,B002,09600,09002,Aigues-Vives,09,,,090020000B0501,,,,,,,,,,,,,0,,,,,S,sols,,,17,1.875569,42.996157
