id_mutation,date_mutation,numero_disposition,nature_mutation,valeur_fonciere,adresse_numero,adresse_suffixe,adresse_nom_voie,adresse_code_voie,code_postal,code_commune,nom_commune,code_departement,ancien_code_commune,ancien_nom_commune,id_parcelle,ancien_id_parcelle,numero_volume,lot1_numero,lot1_surface_carrez,lot2_numero,lot2_surface_carrez,lot3_numero,lot3_surface_carrez,lot4_numero,lot4_surface_carrez,lot5_numero,lot5_surface_carrez,nombre_lots,code_type_local,type_local,surface_reelle_bati,nombre_pieces_principales,code_nature_culture,nature_culture,code_nature_culture_speciale,nature_culture_speciale,surface_terrain,longitude,latitude
2021-110822,2021-02-04,000001,Vente,250000,5200,,ALLANS,B059,09160,09086,Caumont,09,,,090860000B1209,,,,,,,,,,,,,0,4,Local industriel. commercial ou assimilé,660,0,S,sols,,,1000,1.09525,43.025311
2021-110822,2021-02-04,000001,Vente,250000,5200,,ALLANS,B059,09160,09086,Caumont,09,,,090860000B1209,,,,,,,,,,,,,0,4,Local industriel. commercial ou assimilé,660,0,T,terres,,,2849,1.09525,43.025311
2021-111274,2021-03-02,000001,Vente,54000,18,,RTE DEPARTEMENTALE 117,0040,09160,09086,Caumont,09,,,090860000C0299,,,,,,,,,,,,,0,1,Maison,150,5,S,sols,,,210,1.087401,43.027569
2021-111274,2021-03-02,000001,Vente,54000,,,CAGOMIL,B008,09160,09086,Caumont,09,,,090860000C0715,,,,,,,,,,,,,0,,,,,S,sols,,,52,1.087263,43.027679
2021-111274,2021-03-02,000001,Vente,54000,16,,RTE DEPARTEMENTALE 117,0040,09160,09086,Caumont,09,,,090860000C0760,,,,,,,,,,,,,0,,,,,S,sols,,,52,1.08721,43.027719
2021-111552,2021-03-11,000001,Vente,11820,,,LA LANE,B033,09160,09086,Caumont,09,,,09086000ZA0133,,,,,,,,,,,,,0,,,,,T,terres,,,7665,1.101279,43.034774
2021-111552,2021-03-11,000001,Vente,11820,,,LA LANE,B033,09160,09086,Caumont,09,,,09086000ZA0133,,,,,,,,,,,,,0,,,,,T,terres,,,3415,1.101279,43.034774
2021-112415,2021-05-22,000001,Vente,87000,52,,EN GOUST,B027,09160,09086,Caumont,09,,,090860000B1077,,,,,,,,,,,,,0,1,Maison,50,3,S,sols,,,185,1.083492,43.031556
2021-112415,2021-05-22,000001,Vente,87000,,,EN GOUST,B027,09160,09086,Caumont,09,,,09086000ZA0001,,,,,,,,,,,,,0,,,,,P,prés,,,939,1.083306,43.031823
2021-112415,2021-05-22,000001,Vente,87000,,,EN GOUST,B027,09160,09086,Caumont,09,,,09086000ZA0048,,,,,,,,,,,,,0,,,,,S,sols,,,331,1.083578,43.031725
2021-112451,2021-05-18,000001,Vente,3000,,,CAMP DU BOUCH,B011,09160,09086,Caumont,09,,,09086000ZA0040,,,,,,,,,,,,,0,,,,,T,terres,,,5455,1.087333,43.037174
2021-112616,2021-05-17,000001,Vente,12500,,,ALLANS,B059,09160,09086,Caumont,09,,,090860000B1213,,,,,,,,,,,,,0,,,,,T,terres,,,1136,1.093864,43.025507
2021-112616,2021-05-17,000001,Vente,12500,,,ALLANS,B059,09160,09086,Caumont,09,,,090860000B1222,,,,,,,,,,,,,0,,,,,T,terres,,,38,1.094301,43.025563
2021-112616,2021-05-17,000001,Vente,12500,,,ALLANS,B059,09160,09086,Caumont,09,,,090860000B1223,,,,,,,,,,,,,0,,,,,T,terres,,,635,1.094121,43.02548
2021-113320,2021-06-29,000001,Vente,19316.05,,,REYCHAC,B044,09160,09086,Caumont,09,,,090860000C0560,,,,,,,,,,,,,0,,,,,P,prés,,,15575,1.089119,43.016545
2021-113320,2021-06-29,000001,Vente,19316.05,,,REYCHAC,B044,09160,09086,Caumont,09,,,090860000C0571,,,,,,,,,,,,,0,,,,,P,prés,,,2045,1.090152,43.016688
2021-113320,2021-06-29,000001,Vente,19316.05,,,REYCHAC,B044,09160,09086,Caumont,09,,,090860000C0709,,,,,,,,,,,,,0,,,,,S,sols,,,15,1.088853,43.016841
2021-113971,2021-07-20,000001,Vente,10000,5,,PL DU PLECH,0070,09160,09086,Caumont,09,,,090860000A0663,,,,,,,,,,,,,0,,,,,S,sols,,,35,1.083055,43.030476
2021-113971,2021-07-20,000001,Vente,10000,,,VILLAGE,B052,09160,09086,Caumont,09,,,090860000A0669,,,,,,,,,,,,,0,,,,,P,prés,,,632,1.082706,43.030761
2021-113971,2021-07-20,000001,Vente,10000,5,,PL DU PLECH,0070,09160,09086,Caumont,09,,,090860000A0672,,,,,,,,,,,,,0,,,,,S,sols,,,203,1.082981,43.03057
2021-113972,2021-07-20,000002,Vente,145000,4,,PL DU PLECH,0070,09160,09086,Caumont,09,,,090860000A0264,,,,,,,,,,,,,0,1,Maison,62,2,S,sols,,,363,1.083195,43.030386
2021-114165,2021-08-12,000001,Vente,10000,,,COSTOS,B018,09160,09086,Caumont,09,,,090860000C0104,,,,,,,,,,,,,0,,,,,T,terres,,,2475,1.081054,43.023604
2021-114165,2021-08-12,000001,Vente,10000,,,COSTOS,B018,09160,09086,Caumont,09,,,090860000C0105,,,,,,,,,,,,,0,,,,,P,prés,,,1100,1.081023,43.023084
2021-114165,2021-08-12,000001,Vente,10000,,,COSTOS,B018,09160,09086,Caumont,09,,,090860000C0106,,,,,,,,,,,,,0,,,,,BT,taillis simples,,,1095,1.080806,43.022954
2021-114165,2021-08-12,000001,Vente,10000,,,COSTOS,B018,09160,09086,Caumont,09,,,090860000C0111,,,,,,,,,,,,,0,,,,,P,prés,,,2060,1.081603,43.023266
2021-114165,2021-08-12,000001,Vente,10000,,,COSTOS,B018,09160,09086,Caumont,09,,,090860000C0120,,,,,,,,,,,,,0,,,,,P,prés,,,3630,1.083341,43.023624
2021-114165,2021-08-12,000001,Vente,10000,,,COSTOS,B018,09160,09086,Caumont,09,,,090860000C0121,,,,,,,,,,,,,0,,,,,P,prés,,,11880,1.083869,43.023776
2021-114165,2021-08-12,000001,Vente,10000,,,COSTOS,B018,09160,09086,Caumont,09,,,090860000C0122,,,,,,,,,,,,,0,,,,,BT,taillis simples,,,5660,1.082801,43.025182
2021-114165,2021-08-12,000001,Vente,10000,,,CAP DEL PRAT BEDIAOU,B014,09160,09086,Caumont,09,,,090860000C0836,,,,,,,,,,,,,0,,,,,P,prés,,,18347,1.083708,43.02568
2021-114618,2021-09-21,000001,Vente,3000,,,COSTOS,B018,09160,09086,Caumont,09,,,090860000C0126,,,,,,,,,,,,,0,,,,,BT,taillis simples,,,1300,1.082544,43.02398
2021-114618,2021-09-21,000001,Vente,3000,,,CAZALASSES,B016,09160,09086,Caumont,09,,,090860000C0174,,,,,,,,,,,,,0,,,,,P,prés,,,1435,1.078578,43.025662
2021-114618,2021-09-21,000001,Vente,3000,,,CAZALASSES,B016,09160,09086,Caumont,09,,,090860000C0175,,,,,,,,,,,,,0,,,,,P,prés,,,3020,1.079018,43.025432
2021-114618,2021-09-21,000001,Vente,3000,,,CAZALASSES,B016,09160,09086,Caumont,09,,,090860000C0183,,,,,,,,,,,,,0,,,,,BT,taillis simples,,,1302,1.079646,43.026788
2021-114618,2021-09-21,000001,Vente,3000,,,CAZALASSES,B016,09160,09086,Caumont,09,,,090860000C0196,,,,,,,,,,,,,0,,,,,BT,taillis simples,,,1205,1.079906,43.027373
2021-114618,2021-09-21,000001,Vente,3000,,,CAZALASSES,B016,09160,09086,Caumont,09,,,090860000C0216,,,,,,,,,,,,,0,,,,,P,prés,,,1340,1.082224,43.027567
2021-114618,2021-09-21,000001,Vente,3000,,,CAZALASSES,B016,09160,09086,Caumont,09,,,090860000C0218,,,,,,,,,,,,,0,,,,,P,prés,,,1110,1.0816,43.027386
2021-114618,2021-09-21,000001,Vente,3000,,,CAZALASSES,B016,09160,09086,Caumont,09,,,090860000C0219,,,,,,,,,,,,,0,,,,,P,prés,,,600,1.081361,43.027286
2021-114618,2021-09-21,000001,Vente,3000,,,CAZALASSES,B016,09160,09086,Caumont,09,,,090860000C0220,,,,,,,,,,,,,0,,,,,BT,taillis simples,,,1990,1.081177,43.02764
2021-114667,2021-09-21,000001,Vente,1500,,,COSTOS,B018,09160,09086,Caumont,09,,,090860000C0123,,,,,,,,,,,,,0,,,,,P,prés,,,4580,1.082812,43.024426
2021-114667,2021-09-21,000001,Vente,1500,,,COSTOS,B018,09160,09086,Caumont,09,,,090860000C0124,,,,,,,,,,,,,0,,,,,S,sols,,,15,1.082567,43.024721
2021-115001,2021-10-07,000001,Vente,50,,,EN GOUST,B027,09160,09086,Caumont,09,,,090860000B0025,,,,,,,,,,,,,0,,,,,J,jardins,,,150,1.083005,43.031397
2021-115826,2021-11-26,000001,Vente,64000,,,COSTOS,B018,09160,09086,Caumont,09,,,090860000C0114,,,,,,,,,,,,,0,,,,,BT,taillis simples,,,3480,1.081979,43.0236
2021-115826,2021-11-26,000001,Vente,64000,,,CAZALASSES,B016,09160,09086,Caumont,09,,,090860000C0207,,,,,,,,,,,,,0,,,,,P,prés,,,3780,1.081163,43.026702
2021-115826,2021-11-26,000001,Vente,64000,,,CAZALASSES,B016,09160,09086,Caumont,09,,,090860000C0212,,,,,,,,,,,,,0,,,,,P,prés,,,620,1.082698,43.027383
2021-115826,2021-11-26,000001,Vente,64000,,,CAZALASSES,B016,09160,09086,Caumont,09,,,090860000C0213,,,,,,,,,,,,,0,,,,,S,sols,,,140,1.082819,43.027608
2021-115826,2021-11-26,000001,Vente,64000,,,VILLAGE,B052,09160,09086,Caumont,09,,,090860000C0230,,,,,,,,,,,,,0,,,,,J,jardins,,,460,1.082208,43.027694
2021-115826,2021-11-26,000001,Vente,64000,4,,PL BEDIAOU,0015,09160,09086,Caumont,09,,,090860000C0258,,,,,,,,,,,,,0,1,Maison,128,5,S,sols,,,43,1.083417,43.027967
2021-115826,2021-11-26,000001,Vente,64000,,,LA LANE,B033,09160,09086,Caumont,09,,,09086000ZA0117,,,,,,,,,,,,,0,,,,,T,terres,,,1306,1.092795,43.035543
2021-116542,2021-12-20,000001,Vente,85000,7,,RTE DEPARTEMENTALE 117,0040,09160,09086,Caumont,09,,,090860000B1027,,,,,,,,,,,,,0,1,Maison,82,3,S,sols,,,152,1.084107,43.03054
