id_mutation,date_mutation,numero_disposition,nature_mutation,valeur_fonciere,adresse_numero,adresse_suffixe,adresse_nom_voie,adresse_code_voie,code_postal,code_commune,nom_commune,code_departement,ancien_code_commune,ancien_nom_commune,id_parcelle,ancien_id_parcelle,numero_volume,lot1_numero,lot1_surface_carrez,lot2_numero,lot2_surface_carrez,lot3_numero,lot3_surface_carrez,lot4_numero,lot4_surface_carrez,lot5_numero,lot5_surface_carrez,nombre_lots,code_type_local,type_local,surface_reelle_bati,nombre_pieces_principales,code_nature_culture,nature_culture,code_nature_culture_speciale,nature_culture_speciale,surface_terrain,longitude,latitude
2021-110552,2021-01-25,000001,Vente,900,,,LA PLAINE,B143,09300,09125,Fougax-et-Barrineuf,09,,,091250000C0036,,,,,,,,,,,,,0,,,,,T,terres,,,4211,1.884342,42.880846
2021-110552,2021-01-25,000001,Vente,900,,,LA PLAINE,B143,09300,09125,Fougax-et-Barrineuf,09,,,091250000C0037,,,,,,,,,,,,,0,,,,,BS,taillis sous futaie,,,2550,1.885604,42.881801
2021-110621,2021-01-19,000001,Vente,110000,7,,RES JEAN FEVRIER,A006,09300,09125,Fougax-et-Barrineuf,09,,,09125000AC0239,,,,,,,,,,,,,0,1,Maison,79,4,S,sols,,,554,1.898761,42.883638
2021-110662,2021-01-29,000001,Vente,380000,,,LES CONTES,B054,09300,09125,Fougax-et-Barrineuf,09,,,091250000C0001,,,,,,,,,,,,,0,,,,,P,prés,,,1516,1.872424,42.883388
2021-110662,2021-01-29,000001,Vente,380000,,,LES CONTES,B054,09300,09125,Fougax-et-Barrineuf,09,,,091250000C0002,,,,,,,,,,,,,0,,,,,BR,futaies résineuses,,,44182,1.871518,42.883037
2021-110662,2021-01-29,000001,Vente,380000,299,,LES CONTES,B054,09300,09125,Fougax-et-Barrineuf,09,,,091250000C0003,,,,,,,,,,,,,0,4,Local industriel. commercial ou assimilé,,0,S,sols,,,4708,1.873659,42.882878
2021-111088,2021-02-24,000001,Vente,1,,,LA PLAINE,B143,09300,09125,Fougax-et-Barrineuf,09,,,091250000B1307,,,,,,,,,,,,,0,,,,,L,landes,,,116,1.948745,42.86046
2021-111095,2021-03-01,000001,Vente,10000,258,B,PLANOL DEL MOULI,B156,09300,09125,Fougax-et-Barrineuf,09,,,091250000B3243,,,,,,,,,,,,,0,3,Dépendance,,0,T,terres,,,513,1.890893,42.869766
2021-111095,2021-03-01,000001,Vente,10000,258,B,PLANOL DEL MOULI,B156,09300,09125,Fougax-et-Barrineuf,09,,,091250000B3243,,,,,,,,,,,,,0,3,Dépendance,,0,S,sols,,,52,1.890893,42.869766
2021-111095,2021-03-01,000001,Vente,10000,,,PLANOL DEL MOULI,B156,09300,09125,Fougax-et-Barrineuf,09,,,091250000B3245,,,,,,,,,,,,,0,,,,,T,terres,,,457,1.891285,42.869643
2021-111222,2021-03-02,000001,Vente,27000,,,PLANOLS,B157,09300,09125,Fougax-et-Barrineuf,09,,,091250000B1590,,,,,,,,,,,,,0,,,,,T,terres,,,280,1.940943,42.861663
2021-111222,2021-03-02,000001,Vente,27000,,,LALIBERT,B102,09300,09125,Fougax-et-Barrineuf,09,,,091250000B1619,,,,,,,,,,,,,0,,,,,J,jardins,,,53,1.940002,42.862151
2021-111222,2021-03-02,000001,Vente,27000,,,LALIBERT,B102,09300,09125,Fougax-et-Barrineuf,09,,,091250000B1621,,,,,,,,,,,,,0,,,,,L,landes,,,107,1.940046,42.86227
2021-111222,2021-03-02,000001,Vente,27000,282,,LALIBERT,B102,09300,09125,Fougax-et-Barrineuf,09,,,091250000B1664,,,,,,,,,,,,,0,1,Maison,45,1,S,sols,,,58,1.940025,42.862531
2021-111264,2021-03-10,000001,Vente,17000,365,,PLANOL DEL MOULI,B156,09300,09125,Fougax-et-Barrineuf,09,,,091250000B3001,,,,,,,,,,,,,0,3,Dépendance,,0,S,sols,,,1143,1.891436,42.869881
2021-111264,2021-03-10,000001,Vente,17000,,,PLANOL DEL MOULI,B156,09300,09125,Fougax-et-Barrineuf,09,,,091250000B3002,,,,,,,,,,,,,0,,,,,P,prés,,,325,1.891117,42.869797
2021-111264,2021-03-10,000001,Vente,17000,,,PLANOL DEL MOULI,B156,09300,09125,Fougax-et-Barrineuf,09,,,091250000B3008,,,,,,,,,,,,,0,,,,,J,jardins,,,135,1.89122,42.870031
2021-111937,2021-04-14,000001,Vente,144300,1,,RES JEAN FEVRIER,A006,09300,09125,Fougax-et-Barrineuf,09,,,09125000AC0233,,,,,,,,,,,,,0,1,Maison,95,4,S,sols,,,763,1.898684,42.88336
2021-112271,2021-04-21,000001,Vente,60000,,,BARRINEUF VILLAGE,B014,09300,09125,Fougax-et-Barrineuf,09,,,09125000AB0076,,,,,,,,,,,,,0,,,,,J,jardins,,,497,1.890394,42.879433
2021-112271,2021-04-21,000001,Vente,60000,,,BARRINEUF VILLAGE,B014,09300,09125,Fougax-et-Barrineuf,09,,,09125000AB0077,,,,,,,,,,,,,0,,,,,P,prés,,,126,1.890042,42.879125
2021-112271,2021-04-21,000001,Vente,60000,,,BARRINEUF VILLAGE,B014,09300,09125,Fougax-et-Barrineuf,09,,,09125000AB0078,,,,,,,,,,,,,0,,,,,P,prés,,,129,1.890191,42.879096
2021-112271,2021-04-21,000001,Vente,60000,,,BARRINEUF VILLAGE,B014,09300,09125,Fougax-et-Barrineuf,09,,,09125000AB0079,,,,,,,,,,,,,0,,,,,J,jardins,,,549,1.890489,42.879378
2021-112271,2021-04-21,000001,Vente,60000,31,,RUE SAINT JOSEPH,0090,09300,09125,Fougax-et-Barrineuf,09,,,09125000AB0472,,,,,,,,,,,,,0,1,Maison,90,5,S,sols,,,91,1.890606,42.879661
2021-112271,2021-04-21,000001,Vente,60000,31,,RUE SAINT JOSEPH,0090,09300,09125,Fougax-et-Barrineuf,09,,,09125000AB0473,,,,,,,,,,,,,0,,,,,S,sols,,,26,1.890411,42.879507
2021-112290,2021-05-07,000001,Vente,1000,,,FOUNT DEL SERIE,B083,09300,09125,Fougax-et-Barrineuf,09,,,091250000C1803,,,,,,,,,,,,,0,,,,,BR,futaies résineuses,,,7810,1.877749,42.874656
2021-112304,2021-05-04,000001,Vente,4000,,,HAMEAU DE DELALAYGUE,B093,09300,09125,Fougax-et-Barrineuf,09,,,091250000B0649,,,,,,,,,,,,,0,,,,,T,terres,,,1603,1.909621,42.886354
2021-112775,2021-06-01,000001,Vente,85000,6,,MARTINET,B119,09300,09125,Fougax-et-Barrineuf,09,,,091250000A1059,,,,,,,,,,,,,0,1,Maison,158,7,P,prés,,,2022,1.895746,42.884095
2021-112775,2021-06-01,000001,Vente,85000,6,,MARTINET,B119,09300,09125,Fougax-et-Barrineuf,09,,,091250000A1059,,,,,,,,,,,,,0,1,Maison,158,7,S,sols,,,344,1.895746,42.884095
2021-112775,2021-06-01,000001,Vente,85000,,,SARRAT DE MAURY,B196,09300,09125,Fougax-et-Barrineuf,09,,,091250000A1060,,,,,,,,,,,,,0,,,,,P,prés,,,374,1.895579,42.883941
2021-112889,2021-06-07,000001,Vente,900,,,BARRINEUF VILLAGE,B014,09300,09125,Fougax-et-Barrineuf,09,,,09125000AB0084,,,,,,,,,,,,,0,,,,,J,jardins,,,70,1.890704,42.879442
2021-112941,2021-06-16,000001,Vente,48000,8,,RUE DU PONT D'ARDILLE,0060,09300,09125,Fougax-et-Barrineuf,09,,,09125000AB0201,,,,,,,,,,,,,0,1,Maison,102,5,S,sols,,,80,1.892875,42.879894
2021-112941,2021-06-16,000001,Vente,48000,,,PONT D ARDILLE,B159,09300,09125,Fougax-et-Barrineuf,09,,,09125000AB0214,,,,,,,,,,,,,0,,,,,S,sols,,,70,1.893118,42.879732
2021-113157,2021-06-28,000001,Echange,30000,,,SARRAT DEL MIQUO,B199,09300,09125,Fougax-et-Barrineuf,09,,,091250000B0173,,,,,,,,,,,,,0,,,,,L,landes,,,1400,1.930364,42.878064
2021-113157,2021-06-28,000001,Echange,30000,,,SARRAT DEL MIQUO,B199,09300,09125,Fougax-et-Barrineuf,09,,,091250000B0174,,,,,,,,,,,,,0,,,,,BT,taillis simples,,,1640,1.929991,42.878392
2021-113157,2021-06-28,000001,Echange,30000,,,SARRAT DEL MIQUO,B199,09300,09125,Fougax-et-Barrineuf,09,,,091250000B0175,,,,,,,,,,,,,0,,,,,BT,taillis simples,,,300,1.929257,42.878092
2021-113157,2021-06-28,000001,Echange,30000,,,SARRAT DEL MIQUO,B199,09300,09125,Fougax-et-Barrineuf,09,,,091250000B0176,,,,,,,,,,,,,0,,,,,P,prés,,,12746,1.927737,42.877662
2021-113157,2021-06-28,000001,Echange,30000,,,SARRAT DEL MIQUO,B199,09300,09125,Fougax-et-Barrineuf,09,,,091250000B0179,,,,,,,,,,,,,0,,,,,L,landes,,,4675,1.928662,42.87643
2021-113157,2021-06-28,000001,Echange,30000,,,SARRAT DEL MIQUO,B199,09300,09125,Fougax-et-Barrineuf,09,,,091250000B0182,,,,,,,,,,,,,0,,,,,BS,taillis sous futaie,,,11500,1.926363,42.876587
2021-113157,2021-06-28,000001,Echange,30000,,,SARRAT DEL MIQUO,B199,09300,09125,Fougax-et-Barrineuf,09,,,091250000B0183,,,,,,,,,,,,,0,,,,,L,landes,,,847,1.927041,42.876425
2021-113157,2021-06-28,000001,Echange,30000,,,SARRAT DEL MIQUO,B199,09300,09125,Fougax-et-Barrineuf,09,,,091250000B0184,,,,,,,,,,,,,0,,,,,L,landes,,,2444,1.927384,42.876114
2021-113157,2021-06-28,000001,Echange,30000,,,SARRAT DEL MIQUO,B199,09300,09125,Fougax-et-Barrineuf,09,,,091250000B0185,,,,,,,,,,,,,0,,,,,BS,taillis sous futaie,,,2607,1.926918,42.875866
2021-113157,2021-06-28,000001,Echange,30000,,,SARRAT DEL MIQUO,B199,09300,09125,Fougax-et-Barrineuf,09,,,091250000B0188,,,,,,,,,,,,,0,,,,,BS,taillis sous futaie,,,1613,1.925939,42.875629
2021-113157,2021-06-28,000001,Echange,30000,,,SARRAT DEL MIQUO,B199,09300,09125,Fougax-et-Barrineuf,09,,,091250000B0189,,,,,,,,,,,,,0,,,,,P,prés,,,11301,1.925321,42.875933
2021-113157,2021-06-28,000001,Echange,30000,,,LES CHIMBAUDOS,B046,09300,09125,Fougax-et-Barrineuf,09,,,091250000B0938,,,,,,,,,,,,,0,,,,,BT,taillis simples,,,8050,1.908172,42.874906
2021-113157,2021-06-28,000001,Echange,30000,,,LE BERGERET,B018,09300,09125,Fougax-et-Barrineuf,09,,,091250000B0971,,,,,,,,,,,,,0,,,,,BT,taillis simples,,,7180,1.90686,42.874137
2021-113157,2021-06-28,000001,Echange,30000,,,TAILLAT DEL ROUSTIT,B229,09300,09125,Fougax-et-Barrineuf,09,,,091250000B1093,,,,,,,,,,,,,0,,,,,BT,taillis simples,,,386,1.927006,42.873167
2021-113157,2021-06-28,000001,Echange,30000,,,TAILLAT DEL ROUSTIT,B229,09300,09125,Fougax-et-Barrineuf,09,,,091250000B1096,,,,,,,,,,,,,0,,,,,BS,taillis sous futaie,,,7017,1.928603,42.875058
2021-113157,2021-06-28,000001,Echange,30000,,,TAILLAT DEL ROUSTIT,B229,09300,09125,Fougax-et-Barrineuf,09,,,091250000B1098,,,,,,,,,,,,,0,,,,,BS,taillis sous futaie,,,4035,1.929144,42.873462
2021-113157,2021-06-28,000001,Echange,30000,,,TAILLAT DEL ROUSTIT,B229,09300,09125,Fougax-et-Barrineuf,09,,,091250000B1100,,,,,,,,,,,,,0,,,,,BR,futaies résineuses,,,13575,1.927842,42.873357
2021-113157,2021-06-28,000001,Echange,30000,,,TAILLAT DEL ROUSTIT,B229,09300,09125,Fougax-et-Barrineuf,09,,,091250000B1101,,,,,,,,,,,,,0,,,,,BR,futaies résineuses,,,20224,1.929442,42.87242
2021-113157,2021-06-28,000001,Echange,30000,,,BOUZETE,B036,09300,09125,Fougax-et-Barrineuf,09,,,091250000B1108,,,,,,,,,,,,,0,,,,,L,landes,,,9837,1.929027,42.876127
2021-113157,2021-06-28,000001,Echange,30000,,,BOUZETE,B036,09300,09125,Fougax-et-Barrineuf,09,,,091250000B1112,,,,,,,,,,,,,0,,,,,L,landes,,,2592,1.929756,42.876153
2021-113157,2021-06-28,000001,Echange,30000,,,MILLASSA,B123,09300,09125,Fougax-et-Barrineuf,09,,,091250000B1135,,,,,,,,,,,,,0,,,,,BR,futaies résineuses,,,1455,1.934163,42.873346
2021-113157,2021-06-28,000001,Echange,30000,,,MILLASSA,B123,09300,09125,Fougax-et-Barrineuf,09,,,091250000B1148,,,,,,,,,,,,,0,,,,,BR,futaies résineuses,,,4140,1.936079,42.872162
2021-113157,2021-06-28,000001,Echange,30000,,,FONTAINE DES OISEAUX,B074,09300,09125,Fougax-et-Barrineuf,09,,,091250000B1161,,,,,,,,,,,,,0,,,,,BR,futaies résineuses,,,11086,1.926754,42.870504
2021-113157,2021-06-28,000001,Echange,30000,,,FOURRE DU SOULA D ESPINE,B084,09300,09125,Fougax-et-Barrineuf,09,,,091250000B2763,,,,,,,,,,,,,0,,,,,BS,taillis sous futaie,,,1060,1.900388,42.866621
2021-113157,2021-06-28,000001,Echange,30000,,,FOURRE DU SOULA D ESPINE,B084,09300,09125,Fougax-et-Barrineuf,09,,,091250000B2764,,,,,,,,,,,,,0,,,,,BS,taillis sous futaie,,,931,1.900016,42.866352
2021-113157,2021-06-28,000001,Echange,30000,,,LE TEIL,B230,09300,09125,Fougax-et-Barrineuf,09,,,091250000B2777,,,,,,,,,,,,,0,,,,,BS,taillis sous futaie,,,995,1.902955,42.865459
2021-113157,2021-06-28,000001,Echange,30000,,,LE TEIL,B230,09300,09125,Fougax-et-Barrineuf,09,,,091250000B2778,,,,,,,,,,,,,0,,,,,BS,taillis sous futaie,,,5283,1.903226,42.866022
2021-113157,2021-06-28,000001,Echange,30000,,,BOIS SOULA D ESPINE DE MON,B028,09300,09125,Fougax-et-Barrineuf,09,,,091250000B2796,,,,,,,,,,,,,0,,,,,BS,taillis sous futaie,,,370,1.8998,42.869488
2021-113157,2021-06-28,000001,Echange,30000,,,SOULA DU BOUTTIL,B227,09300,09125,Fougax-et-Barrineuf,09,,,091250000B2813,,,,,,,,,,,,,0,,,,,BR,futaies résineuses,,,1176,1.905281,42.864613
2021-113157,2021-06-28,000001,Echange,30000,,,SOULA DU BOUTTIL,B227,09300,09125,Fougax-et-Barrineuf,09,,,091250000B2814,,,,,,,,,,,,,0,,,,,BR,futaies résineuses,,,3390,1.905386,42.865241
2021-113297,2021-06-30,000002,Vente,11000,,,PRAT BARRAT,B164,09300,09125,Fougax-et-Barrineuf,09,,,091250000A1311,,,,,,,,,,,,,0,,,,,P,prés,,,1491,1.89429,42.883669
2021-113564,2021-07-13,000001,Vente,130000,,,FONTESTORBES,B075,09300,09125,Fougax-et-Barrineuf,09,,,091250000B0011,,,,,,,,,,,,,0,,,,,L,landes,,,862,1.925737,42.891953
2021-113564,2021-07-13,000001,Vente,130000,,,FONTESTORBES,B075,09300,09125,Fougax-et-Barrineuf,09,,,091250000B0012,,,,,,,,,,,,,0,,,,,E,eaux,LAC,Lac,239,1.925537,42.891879
2021-113564,2021-07-13,000001,Vente,130000,,,FONTESTORBES,B075,09300,09125,Fougax-et-Barrineuf,09,,,091250000B0013,,,,,,,,,,,,,0,,,,,BT,taillis simples,,,245,1.925482,42.891885
2021-113564,2021-07-13,000001,Vente,130000,227,,FONTESTORBES,B075,09300,09125,Fougax-et-Barrineuf,09,,,091250000B0014,,,,,,,,,,,,,0,1,Maison,245,8,S,sols,,,2918,1.92486,42.891563
2021-113564,2021-07-13,000001,Vente,130000,,,FONTESTORBES,B075,09300,09125,Fougax-et-Barrineuf,09,,,091250000B0015,,,,,,,,,,,,,0,,,,,BT,taillis simples,,,607,1.923896,42.891172
2021-113564,2021-07-13,000001,Vente,130000,,,FONTESTORBES,B075,09300,09125,Fougax-et-Barrineuf,09,,,091250000B0016,,,,,,,,,,,,,0,,,,,E,eaux,LAC,Lac,343,1.923891,42.891086
2021-113564,2021-07-13,000001,Vente,130000,,,FONTESTORBES,B075,09300,09125,Fougax-et-Barrineuf,09,,,091250000B0017,,,,,,,,,,,,,0,,,,,BT,taillis simples,,,1045,1.923425,42.890877
2021-113567,2021-07-21,000001,Vente,65000,8,,RUE SAINT MICHEL,0070,09300,09125,Fougax-et-Barrineuf,09,,,09125000AC0207,,,,,,,,,,,,,0,1,Maison,125,5,S,sols,,,300,1.898817,42.885864
2021-113567,2021-07-21,000001,Vente,65000,8,,RUE SAINT MICHEL,0070,09300,09125,Fougax-et-Barrineuf,09,,,09125000AC0207,,,,,,,,,,,,,0,3,Dépendance,,0,S,sols,,,300,1.898817,42.885864
2021-113567,2021-07-21,000001,Vente,65000,,,FOUGAX VILLAGE,B078,09300,09125,Fougax-et-Barrineuf,09,,,09125000AC0209,,,,,,,,,,,,,0,,,,,P,prés,,,81,1.898663,42.886127
2021-113567,2021-07-21,000001,Vente,65000,,,FOUGAX VILLAGE,B078,09300,09125,Fougax-et-Barrineuf,09,,,09125000AC0209,,,,,,,,,,,,,0,,,,,S,sols,,,25,1.898663,42.886127
2021-113567,2021-07-21,000001,Vente,65000,,,FOUGAX VILLAGE,B078,09300,09125,Fougax-et-Barrineuf,09,,,09125000AC0213,,,,,,,,,,,,,0,,,,,S,sols,,,3,1.898824,42.885896
2021-113567,2021-07-21,000001,Vente,65000,,,FOUGAX VILLAGE,B078,09300,09125,Fougax-et-Barrineuf,09,,,09125000AC0214,,,,,,,,,,,,,0,,,,,S,sols,,,1,1.898671,42.886165
2021-113773,2021-07-26,000001,Vente,180000,16,,RUE SAINT MICHEL,0070,09300,09125,Fougax-et-Barrineuf,09,,,09125000AC0032,,,,,,,,,,,,,0,1,Maison,160,5,S,sols,,,253,1.898504,42.885715
2021-113861,2021-07-29,000001,Vente,107000,3,,CRISTOLS,B064,09300,09125,Fougax-et-Barrineuf,09,,,09125000AB0235,,,,,,,,,,,,,0,3,Dépendance,,0,S,sols,,,241,1.893144,42.88037
2021-113861,2021-07-29,000001,Vente,107000,3,,CRISTOLS,B064,09300,09125,Fougax-et-Barrineuf,09,,,09125000AB0235,,,,,,,,,,,,,0,1,Maison,90,5,S,sols,,,241,1.893144,42.88037
2021-113861,2021-07-29,000001,Vente,107000,,,PONT D ARDILLE,B159,09300,09125,Fougax-et-Barrineuf,09,,,09125000AB0411,,,,,,,,,,,,,0,,,,,J,jardins,,,449,1.893217,42.880171
2021-114354,2021-09-10,000001,Vente,255000,,,LES BERNILLES,B019,09300,09125,Fougax-et-Barrineuf,09,,,091250000B0443,,,,,,,,,,,,,0,,,,,J,jardins,,,824,1.901792,42.883666
2021-114354,2021-09-10,000001,Vente,255000,,,LES BERNILLES,B019,09300,09125,Fougax-et-Barrineuf,09,,,091250000B0443,,,,,,,,,,,,,0,,,,,S,sols,,,361,1.901792,42.883666
2021-114354,2021-09-10,000001,Vente,255000,,,LES BERNILLES,B019,09300,09125,Fougax-et-Barrineuf,09,,,091250000B0443,,,,,,,,,,,,,0,,,,,P,prés,,,1067,1.901792,42.883666
2021-114354,2021-09-10,000001,Vente,255000,,,LES BERNILLES,B019,09300,09125,Fougax-et-Barrineuf,09,,,091250000B0444,,,,,,,,,,,,,0,,,,,L,landes,,,151,1.901883,42.883383
2021-114354,2021-09-10,000001,Vente,255000,1,,LES BERNILLES,B019,09300,09125,Fougax-et-Barrineuf,09,,,091250000B0445,,,,,,,,,,,,,0,1,Maison,122,5,P,prés,,,730,1.902083,42.883836
2021-114354,2021-09-10,000001,Vente,255000,1,,LES BERNILLES,B019,09300,09125,Fougax-et-Barrineuf,09,,,091250000B0445,,,,,,,,,,,,,0,3,Dépendance,,0,S,sols,,,1478,1.902083,42.883836
2021-114354,2021-09-10,000001,Vente,255000,1,,LES BERNILLES,B019,09300,09125,Fougax-et-Barrineuf,09,,,091250000B0445,,,,,,,,,,,,,0,1,Maison,122,5,S,sols,,,1478,1.902083,42.883836
2021-114354,2021-09-10,000001,Vente,255000,1,,LES BERNILLES,B019,09300,09125,Fougax-et-Barrineuf,09,,,091250000B0445,,,,,,,,,,,,,0,3,Dépendance,,0,P,prés,,,730,1.902083,42.883836
2021-114354,2021-09-10,000001,Vente,255000,,,LES BERNILLES,B019,09300,09125,Fougax-et-Barrineuf,09,,,091250000B0446,,,,,,,,,,,,,0,,,,,P,prés,,,800,1.902298,42.883566
2021-114354,2021-09-10,000001,Vente,255000,,,LES BERNILLES,B019,09300,09125,Fougax-et-Barrineuf,09,,,091250000B0448,,,,,,,,,,,,,0,,,,,P,prés,,,3133,1.902519,42.882785
2021-114354,2021-09-10,000001,Vente,255000,,,LES BERNILLES,B019,09300,09125,Fougax-et-Barrineuf,09,,,091250000B0451,,,,,,,,,,,,,0,,,,,P,prés,,,770,1.902328,42.882396
2021-114354,2021-09-10,000001,Vente,255000,,,LES BERNILLES,B019,09300,09125,Fougax-et-Barrineuf,09,,,091250000B0453,,,,,,,,,,,,,0,,,,,P,prés,,,580,1.902739,42.882357
2021-114394,2021-08-11,000002,Vente,25000,164,,FOUGAX VILLAGE,B078,09300,09125,Fougax-et-Barrineuf,09,,,09125000AC0305,,,,,,,,,,,,,0,3,Dépendance,,0,,,,,,1.900179,42.885063
2021-114394,2021-08-11,000002,Vente,25000,164,,FOUGAX VILLAGE,B078,09300,09125,Fougax-et-Barrineuf,09,,,09125000AC0305,,,,,,,,,,,,,0,3,Dépendance,,0,,,,,,1.900179,42.885063
2021-114514,2021-09-07,000001,Vente,140000,1,,QUA CLAOUSO,A003,09300,09125,Fougax-et-Barrineuf,09,,,09125000AB0183,,,,,,,,,,,,,0,1,Maison,92,4,S,sols,,,562,1.891309,42.880076
2021-114779,2021-09-27,000001,Vente,200,,,PELAIL,B133,09300,09125,Fougax-et-Barrineuf,09,,,091250000C1094,,,,,,,,,,,,,0,,,,,P,prés,,,235,1.875153,42.853701
2021-114779,2021-09-27,000002,Vente,200,,,DESSUS LE BESAL,B068,09300,09125,Fougax-et-Barrineuf,09,,,091250000C1831,,,,,,,,,,,,,0,,,,,P,prés,,,364,1.890189,42.878715
2021-114779,2021-09-27,000001,Vente,200,,,LA MARGARIDO,B117,09300,09125,Fougax-et-Barrineuf,09,,,091250000C1095,,,,,,,,,,,,,0,,,,,T,terres,,,158,1.875251,42.853612
2021-114779,2021-09-27,000001,Vente,200,,,LA MARGARIDO,B117,09300,09125,Fougax-et-Barrineuf,09,,,091250000C1098,,,,,,,,,,,,,0,,,,,BT,taillis simples,,,8,1.875742,42.853779
2021-114779,2021-09-27,000001,Vente,200,,,LA MARGARIDO,B117,09300,09125,Fougax-et-Barrineuf,09,,,091250000C1099,,,,,,,,,,,,,0,,,,,T,terres,,,201,1.875609,42.853718
2021-114780,2021-09-28,000001,Vente,500,,,LA MARGARIDO,B117,09300,09125,Fougax-et-Barrineuf,09,,,091250000C1096,,,,,,,,,,,,,0,,,,,T,terres,,,770,1.875424,42.853858
2021-114780,2021-09-28,000001,Vente,500,,,LA MARGARIDO,B117,09300,09125,Fougax-et-Barrineuf,09,,,091250000C1097,,,,,,,,,,,,,0,,,,,BT,taillis simples,,,144,1.875705,42.853947
2021-114890,2021-09-27,000001,Vente,10000,,,CAUJOUS,B044,09300,09125,Fougax-et-Barrineuf,09,,,091250000B0240,,,,,,,,,,,,,0,,,,,S,sols,,,984,1.917404,42.883824
2021-114890,2021-09-27,000001,Vente,10000,,,CAUJOUS,B044,09300,09125,Fougax-et-Barrineuf,09,,,091250000B3401,,,,,,,,,,,,,0,,,,,L,landes,,,977,1.917332,42.883571
2021-114890,2021-09-27,000001,Vente,10000,,,CAUJOUS,B044,09300,09125,Fougax-et-Barrineuf,09,,,091250000B3404,,,,,,,,,,,,,0,,,,,BS,taillis sous futaie,,,2043,1.917118,42.883932
2021-114915,2021-09-27,000001,Vente,37000,,,COUME TOURNIERE,B058,09300,09125,Fougax-et-Barrineuf,09,,,091250000A0927,,,,,,,,,,,,,0,,,,,BS,taillis sous futaie,,,1070,1.91396,42.890756
2021-114915,2021-09-27,000001,Vente,37000,,,FAVA,B072,09300,09125,Fougax-et-Barrineuf,09,,,091250000A0950,,,,,,,,,,,,,0,,,,,P,prés,,,3433,1.908669,42.88769
2021-114915,2021-09-27,000001,Vente,37000,,,SAVARIS,B201,09300,09125,Fougax-et-Barrineuf,09,,,091250000A0979,,,,,,,,,,,,,0,,,,,BS,taillis sous futaie,,,885,1.911997,42.890144
2021-114915,2021-09-27,000001,Vente,37000,,,SAVARIS,B201,09300,09125,Fougax-et-Barrineuf,09,,,091250000A0992,,,,,,,,,,,,,0,,,,,L,landes,,,7470,1.909149,42.890326
2021-114915,2021-09-27,000001,Vente,37000,,,SAVARIS,B201,09300,09125,Fougax-et-Barrineuf,09,,,091250000A0993,,,,,,,,,,,,,0,,,,,BT,taillis simples,,,1118,1.90894,42.890861
2021-114915,2021-09-27,000001,Vente,37000,,,LE TOUSQUIRAT,B234,09300,09125,Fougax-et-Barrineuf,09,,,091250000B0259,,,,,,,,,,,,,0,,,,,L,landes,,,865,1.915178,42.885056
2021-114915,2021-09-27,000001,Vente,37000,,,LE TOUSQUIRAT,B234,09300,09125,Fougax-et-Barrineuf,09,,,091250000B0260,,,,,,,,,,,,,0,,,,,BS,taillis sous futaie,,,4125,1.914796,42.88466
2021-114915,2021-09-27,000001,Vente,37000,,,LES BERNILLES,B019,09300,09125,Fougax-et-Barrineuf,09,,,091250000B0449,,,,,,,,,,,,,0,,,,,P,prés,,,400,1.901949,42.883184
2021-114915,2021-09-27,000001,Vente,37000,,,LES BERNILLES,B019,09300,09125,Fougax-et-Barrineuf,09,,,091250000B0455,,,,,,,,,,,,,0,,,,,P,prés,,,1440,1.903228,42.881886
2021-114915,2021-09-27,000001,Vente,37000,,,PRAT DEL REC,B169,09300,09125,Fougax-et-Barrineuf,09,,,091250000B0510,,,,,,,,,,,,,0,,,,,P,prés,,,1350,1.905569,42.880537
2021-114915,2021-09-27,000001,Vente,37000,,,SOULA DE LA SABATTE,B211,09300,09125,Fougax-et-Barrineuf,09,,,091250000B0521,,,,,,,,,,,,,0,,,,,P,prés,,,1994,1.908467,42.879776
2021-114915,2021-09-27,000001,Vente,37000,,,SOULA DE LA SABATTE,B211,09300,09125,Fougax-et-Barrineuf,09,,,091250000B0522,,,,,,,,,,,,,0,,,,,L,landes,,,3267,1.907841,42.880122
2021-114915,2021-09-27,000001,Vente,37000,,,LES LARGES,B104,09300,09125,Fougax-et-Barrineuf,09,,,091250000B0548,,,,,,,,,,,,,0,,,,,P,prés,,,665,1.903545,42.882503
2021-114915,2021-09-27,000001,Vente,37000,,,DELALAYGUE,B067,09300,09125,Fougax-et-Barrineuf,09,,,091250000B0611,,,,,,,,,,,,,0,,,,,P,prés,,,2348,1.906088,42.886224
2021-114915,2021-09-27,000001,Vente,37000,,,DARRE LE BOSC,B066,09300,09125,Fougax-et-Barrineuf,09,,,091250000B0718,,,,,,,,,,,,,0,,,,,P,prés,,,1413,1.911344,42.886058
2021-114915,2021-09-27,000001,Vente,37000,,,DARRE LE BOSC,B066,09300,09125,Fougax-et-Barrineuf,09,,,091250000B0719,,,,,,,,,,,,,0,,,,,L,landes,,,1468,1.911149,42.885923
2021-114915,2021-09-27,000001,Vente,37000,,,PRAT DE LA FOUNT,B167,09300,09125,Fougax-et-Barrineuf,09,,,091250000B0755,,,,,,,,,,,,,0,,,,,P,prés,,,387,1.905103,42.883845
2021-114915,2021-09-27,000001,Vente,37000,,,PRAT DE LA FOUNT,B167,09300,09125,Fougax-et-Barrineuf,09,,,091250000B0769,,,,,,,,,,,,,0,,,,,P,prés,,,595,1.905335,42.883089
2021-114915,2021-09-27,000001,Vente,37000,,,PRAT DE LA FOUNT,B167,09300,09125,Fougax-et-Barrineuf,09,,,091250000B0770,,,,,,,,,,,,,0,,,,,BT,taillis simples,,,36,1.905328,42.882872
2021-114915,2021-09-27,000001,Vente,37000,,,CLOT DE LA GOUTTE,B051,09300,09125,Fougax-et-Barrineuf,09,,,091250000B0780,,,,,,,,,,,,,0,,,,,P,prés,,,2201,1.90598,42.882335
2021-114915,2021-09-27,000001,Vente,37000,,,CLOT DE LA GOUTTE,B051,09300,09125,Fougax-et-Barrineuf,09,,,091250000B0785,,,,,,,,,,,,,0,,,,,BT,taillis simples,,,1764,1.908008,42.882115
2021-114915,2021-09-27,000001,Vente,37000,,,CLOT DE LA GOUTTE,B051,09300,09125,Fougax-et-Barrineuf,09,,,091250000B0786,,,,,,,,,,,,,0,,,,,BT,taillis simples,,,2150,1.908525,42.882145
2021-114915,2021-09-27,000001,Vente,37000,,,CLOT DE LA GOUTTE,B051,09300,09125,Fougax-et-Barrineuf,09,,,091250000B0788,,,,,,,,,,,,,0,,,,,L,landes,,,1527,1.907926,42.882659
2021-114915,2021-09-27,000001,Vente,37000,,,CLOT DE LA GOUTTE,B051,09300,09125,Fougax-et-Barrineuf,09,,,091250000B0793,,,,,,,,,,,,,0,,,,,P,prés,,,1320,1.906049,42.882737
2021-114915,2021-09-27,000001,Vente,37000,,,CASTAGNES,B043,09300,09125,Fougax-et-Barrineuf,09,,,091250000B0802,,,,,,,,,,,,,0,,,,,BS,taillis sous futaie,,,1528,1.906156,42.883701
2021-114915,2021-09-27,000001,Vente,37000,,,BOSC DU CHATEAU,B031,09300,09125,Fougax-et-Barrineuf,09,,,091250000B0812,,,,,,,,,,,,,0,,,,,BS,taillis sous futaie,,,1125,1.906998,42.884287
2021-114915,2021-09-27,000001,Vente,37000,,,BOSC DU CHATEAU,B031,09300,09125,Fougax-et-Barrineuf,09,,,091250000B0826,,,,,,,,,,,,,0,,,,,BS,taillis sous futaie,,,1300,1.910486,42.884913
2021-114915,2021-09-27,000001,Vente,37000,,,MILLASSOUS,B124,09300,09125,Fougax-et-Barrineuf,09,,,091250000B0841,,,,,,,,,,,,,0,,,,,BT,taillis simples,,,1290,1.913482,42.881626
2021-114915,2021-09-27,000001,Vente,37000,,,MILLASSOUS,B124,09300,09125,Fougax-et-Barrineuf,09,,,091250000B0842,,,,,,,,,,,,,0,,,,,L,landes,,,1950,1.913514,42.88215