id_mutation,date_mutation,numero_disposition,nature_mutation,valeur_fonciere,adresse_numero,adresse_suffixe,adresse_nom_voie,adresse_code_voie,code_postal,code_commune,nom_commune,code_departement,ancien_code_commune,ancien_nom_commune,id_parcelle,ancien_id_parcelle,numero_volume,lot1_numero,lot1_surface_carrez,lot2_numero,lot2_surface_carrez,lot3_numero,lot3_surface_carrez,lot4_numero,lot4_surface_carrez,lot5_numero,lot5_surface_carrez,nombre_lots,code_type_local,type_local,surface_reelle_bati,nombre_pieces_principales,code_nature_culture,nature_culture,code_nature_culture_speciale,nature_culture_speciale,surface_terrain,longitude,latitude
2021-110462,2021-01-22,000001,Vente,50,,,PAQUET,B026,09230,09158,Lasserre,09,,,091580000B2032,,,,,,,,,,,,,0,,,,,S,sols,,,89,1.161883,43.06352
2021-110471,2021-01-04,000001,Vente,38500,,,BIOULE,B004,09230,09158,Lasserre,09,,,091580000A0485,,,,,,,,,,,,,0,,,,,T,terres,,,480,1.162069,43.056973
2021-110471,2021-01-04,000001,Vente,38500,,,BIOULE,B004,09230,09158,Lasserre,09,,,091580000A0488,,,,,,,,,,,,,0,,,,,T,terres,,,2360,1.162297,43.056671
2021-110471,2021-01-04,000001,Vente,38500,,,BIOULE,B004,09230,09158,Lasserre,09,,,091580000A0489,,,,,,,,,,,,,0,,,,,T,terres,,,485,1.161998,43.056634
2021-110471,2021-01-04,000001,Vente,38500,,,BIOULE,B004,09230,09158,Lasserre,09,,,091580000A0492,,,,,,,,,,,,,0,,,,,T,terres,,,1460,,
2021-110471,2021-01-04,000001,Vente,38500,,,LE PAOU,B025,09230,09158,Lasserre,09,,,091580000A0493,,,,,,,,,,,,,0,,,,,BT,taillis simples,,,4130,1.16011,43.056336
2021-110471,2021-01-04,000001,Vente,38500,,,BIOULE,B004,09230,09158,Lasserre,09,,,091580000A0707,,,,,,,,,,,,,0,,,,,T,terres,,,1295,1.161437,43.057025
2021-111116,2021-02-22,000001,Vente,330000,,,VILLAGE,B023,09230,09158,Lasserre,09,,,091580000B0765,,,,,,,,,,,,,0,,,,,S,sols,,,140,1.171457,43.07328
2021-111116,2021-02-22,000001,Vente,330000,,,VILLAGE,B023,09230,09158,Lasserre,09,,,091580000B2045,,,,,,,,,,,,,0,,,,,S,sols,,,79,1.171556,43.073321
2021-111116,2021-02-22,000001,Vente,330000,79,,VILLAGE,B023,09230,09158,Lasserre,09,,,091580000B2046,,,,,,,,,,,,,0,1,Maison,85,7,S,sols,,,480,1.171341,43.073287
2021-111116,2021-02-22,000001,Vente,330000,,,SAUNIERE,B032,09230,09158,Lasserre,09,,,091580000B2048,,,,,,,,,,,,,0,,,,,P,prés,,,1058,1.171148,43.073219
2021-111116,2021-02-22,000001,Vente,330000,,,SAUNIERE,B032,09230,09158,Lasserre,09,,,091580000B2051,,,,,,,,,,,,,0,,,,,P,prés,,,247,1.171012,43.073332
2021-111780,2021-03-24,000001,Vente,235000,182,,GUILLOU,B019,09230,09158,Lasserre,09,,,091580000B2014,,,,,,,,,,,,,0,1,Maison,141,5,S,sols,,,1642,1.171714,43.075072
2021-111780,2021-03-24,000001,Vente,235000,,,GUILLOU,B019,09230,09158,Lasserre,09,,,091580000B2023,,,,,,,,,,,,,0,,,,,P,prés,,,992,1.171225,43.075149
2021-111855,2021-04-16,000001,Vente,100,,,AUBY,B002,09230,09158,Lasserre,09,,,091580000B0315,,,,,,,,,,,,,0,,,,,T,terres,,,200,1.154718,43.076983
2021-112002,2021-04-12,000001,Vente,29000,,,GUILLOU,B019,09230,09158,Lasserre,09,,,091580000B0579,,,,,,,,,,,,,0,,,,,T,terres,,,3410,1.173728,43.079722
2021-112002,2021-04-12,000001,Vente,29000,,,SAUNIERE,B032,09230,09158,Lasserre,09,,,091580000B0686,,,,,,,,,,,,,0,,,,,P,prés,,,1790,1.170771,43.072975
2021-112002,2021-04-12,000001,Vente,29000,73,,VILLAGE,B023,09230,09158,Lasserre,09,,,091580000B0757,,,,,,,,,,,,,0,1,Maison,27,2,S,sols,,,303,1.171281,43.072882
2021-112002,2021-04-12,000001,Vente,29000,,,GOUTORBE,B017,09230,09158,Lasserre,09,,,091580000B1554,,,,,,,,,,,,,0,,,,,L,landes,,,1065,1.169276,43.078548
2021-112002,2021-04-12,000001,Vente,29000,,,SAUNIERE,B032,09230,09158,Lasserre,09,,,091580000B1568,,,,,,,,,,,,,0,,,,,P,prés,,,78,1.171178,43.072987
2021-112252,2021-05-04,000001,Vente,48000,,,SAUNIERE,B032,09230,09158,Lasserre,09,,,091580000B0684,,,,,,,,,,,,,0,,,,,J,jardins,,,505,1.170386,43.073296
2021-112252,2021-05-04,000001,Vente,48000,77,,VILLAGE,B023,09230,09158,Lasserre,09,,,091580000B0761,,,,,,,,,,,,,0,1,Maison,24,1,S,sols,,,145,1.171547,43.072984
2021-112704,2021-06-14,000001,Vente,14000,,,BIOULE,B004,09230,09158,Lasserre,09,,,091580000A0459,,,,,,,,,,,,,0,,,,,J,jardins,,,655,1.160067,43.057888
2021-112949,2021-06-10,000002,Vente,15000,,,LAS BOUZIGUES,B022,09230,09158,Lasserre,09,,,091580000A0710,,,,,,,,,,,,,0,,,,,S,sols,,,185,1.170226,43.069266
2021-113121,2021-06-10,000001,Vente,200,,,LAS BOUZIGUES,B022,09230,09158,Lasserre,09,,,091580000A0711,,,,,,,,,,,,,0,,,,,S,sols,,,180,1.170198,43.069147
2021-113530,2021-07-16,000001,Vente,6000,,,LES CHAUMES,B010,09230,09158,Lasserre,09,,,091580000B0447,,,,,,,,,,,,,0,,,,,L,landes,,,3275,1.163386,43.081433
2021-113530,2021-07-16,000001,Vente,6000,,,LES CHAUMES,B010,09230,09158,Lasserre,09,,,091580000B0450,,,,,,,,,,,,,0,,,,,L,landes,,,860,1.16358,43.081989
2021-113530,2021-07-16,000001,Vente,6000,,,LES CHAUMES,B010,09230,09158,Lasserre,09,,,091580000B0479,,,,,,,,,,,,,0,,,,,L,landes,,,245,1.163794,43.082583
2021-113530,2021-07-16,000001,Vente,6000,,,LES CHAUMES,B010,09230,09158,Lasserre,09,,,091580000B1953,,,,,,,,,,,,,0,,,,,L,landes,,,102,1.160928,43.080101
2021-113530,2021-07-16,000001,Vente,6000,,,LES CHAUMES,B010,09230,09158,Lasserre,09,,,091580000B1954,,,,,,,,,,,,,0,,,,,L,landes,,,1632,1.160271,43.079709
2021-113530,2021-07-16,000001,Vente,6000,,,LES CHAUMES,B010,09230,09158,Lasserre,09,,,091580000B1955,,,,,,,,,,,,,0,,,,,L,landes,,,1276,1.161827,43.080626
2021-113578,2021-07-28,000001,Vente,1000,,,LES FAGNARDS,B013,09230,09158,Lasserre,09,,,091580000A0373,,,,,,,,,,,,,0,,,,,T,terres,,,1400,1.163489,43.061877
2021-113578,2021-07-28,000001,Vente,1000,,,LES FAGNARDS,B013,09230,09158,Lasserre,09,,,091580000A0610,,,,,,,,,,,,,0,,,,,P,prés,,,989,1.163526,43.062039
2021-113578,2021-07-28,000001,Vente,1000,,,LES FAGNARDS,B013,09230,09158,Lasserre,09,,,091580000A0611,,,,,,,,,,,,,0,,,,,P,prés,,,126,1.163511,43.061961
2021-113892,2021-07-28,000001,Vente,4000,,,SAUNIERE,B032,09230,09158,Lasserre,09,,,091580000B0691,,,,,,,,,,,,,0,,,,,P,prés,,,2565,1.17091,43.072089
2021-114066,2021-07-30,000002,Vente,34870,,,SAUNIERE,B032,09230,09158,Lasserre,09,,,091580000B2039,,,,,,,,,,,,,0,,,,,P,prés,,,3487,1.170158,43.071386
2021-114358,2021-08-27,000001,Vente,210000,,,SAUNIERE,B032,09230,09158,Lasserre,09,,,091580000B0692,,,,,,,,,,,,,0,,,,,J,jardins,,,1330,1.170652,43.071668
2021-114358,2021-08-27,000001,Vente,210000,,,VILLAGE,B023,09230,09158,Lasserre,09,,,091580000B0745,,,,,,,,,,,,,0,,,,,J,jardins,,,605,1.171152,43.071375
2021-114358,2021-08-27,000001,Vente,210000,65,,VILLAGE,B023,09230,09158,Lasserre,09,,,091580000B0746,,,,,,,,,,,,,0,1,Maison,169,6,S,sols,,,749,1.171566,43.071368
2021-114358,2021-08-27,000001,Vente,210000,65,,VILLAGE,B023,09230,09158,Lasserre,09,,,091580000B0746,,,,,,,,,,,,,0,3,Dépendance,,0,S,sols,,,749,1.171566,43.071368
2021-114358,2021-08-27,000001,Vente,210000,65,,VILLAGE,B023,09230,09158,Lasserre,09,,,091580000B0746,,,,,,,,,,,,,0,3,Dépendance,,0,S,sols,,,749,1.171566,43.071368
2021-114358,2021-08-27,000001,Vente,210000,65,,VILLAGE,B023,09230,09158,Lasserre,09,,,091580000B0746,,,,,,,,,,,,,0,3,Dépendance,,0,S,sols,,,749,1.171566,43.071368
2021-114358,2021-08-27,000001,Vente,210000,65,,VILLAGE,B023,09230,09158,Lasserre,09,,,091580000B0746,,,,,,,,,,,,,0,4,Local industriel. commercial ou assimilé,13,0,S,sols,,,749,1.171566,43.071368
2021-114358,2021-08-27,000001,Vente,210000,,,VILLAGE,B023,09230,09158,Lasserre,09,,,091580000B0747,,,,,,,,,,,,,0,,,,,P,prés,,,1718,1.171391,43.071436
2021-114395,2021-08-17,000001,Vente,218000,,,VILLAGE,B023,09230,09158,Lasserre,09,,,091580000B0750,,,,,,,,,,,,,0,,,,,J,jardins,,,720,1.171222,43.071929
2021-114395,2021-08-17,000001,Vente,218000,68,,VILLAGE,B023,09230,09158,Lasserre,09,,,091580000B0751,,,,,,,,,,,,,0,1,Maison,126,5,S,sols,,,805,1.171588,43.071947
2021-115015,2021-10-08,000001,Vente,290000,101,,PAQUET,B026,09230,09158,Lasserre,09,,,091580000B1169,,,,,,,,,,,,,0,1,Maison,65,4,S,sols,,,195,1.162998,43.064164
2021-115015,2021-10-08,000001,Vente,290000,,,PAQUET,B026,09230,09158,Lasserre,09,,,091580000B1170,,,,,,,,,,,,,0,,,,,P,prés,,,1335,1.162652,43.064345
2021-115015,2021-10-08,000001,Vente,290000,,,PAQUET,B026,09230,09158,Lasserre,09,,,091580000B1171,,,,,,,,,,,,,0,,,,,P,prés,,,575,1.16244,43.064279
2021-115015,2021-10-08,000001,Vente,290000,,,PEYROUTETS,B028,09230,09158,Lasserre,09,,,091580000B1763,,,,,,,,,,,,,0,,,,,L,landes,,,148,1.163007,43.064297
2021-115015,2021-10-08,000001,Vente,290000,,,PEYROUTETS,B028,09230,09158,Lasserre,09,,,091580000B1765,,,,,,,,,,,,,0,,,,,L,landes,,,77,1.163023,43.064236
2021-115968,2021-12-01,000001,Vente,6000,,,LES CHAUMES,B010,09230,09158,Lasserre,09,,,091580000B0487,,,,,,,,,,,,,0,,,,,L,landes,,,4920,1.166863,43.080828
2021-115968,2021-12-01,000001,Vente,6000,,,SAUNIERE,B032,09230,09158,Lasserre,09,,,091580000B0660,,,,,,,,,,,,,0,,,,,T,terres,,,6180,1.164394,43.074376
2021-115968,2021-12-01,000001,Vente,6000,,,CHAMPS DE LABOURDETTE,B009,09230,09158,Lasserre,09,,,091580000B0906,,,,,,,,,,,,,0,,,,,P,prés,,,755,1.153869,43.069103
2021-115968,2021-12-01,000001,Vente,6000,,,BOSC DE TRINQUE,B005,09230,09158,Lasserre,09,,,091580000B1226,,,,,,,,,,,,,0,,,,,BT,taillis simples,,,1880,1.154272,43.068126
2021-115968,2021-12-01,000001,Vente,6000,,,BOSC DE TRINQUE,B005,09230,09158,Lasserre,09,,,091580000B1227,,,,,,,,,,,,,0,,,,,BT,taillis simples,,,6500,1.15393,43.067746
2021-115968,2021-12-01,000001,Vente,6000,,,BOSC DE TRINQUE,B005,09230,09158,Lasserre,09,,,091580000B1228,,,,,,,,,,,,,0,,,,,L,landes,,,810,1.153724,43.068799
2021-115968,2021-12-01,000001,Vente,6000,,,BOSC DE TRINQUE,B005,09230,09158,Lasserre,09,,,091580000B1237,,,,,,,,,,,,,0,,,,,BT,taillis simples,,,2320,1.154271,43.067349
2021-115968,2021-12-01,000001,Vente,6000,,,AUBY,B002,09230,09158,Lasserre,09,,,091580000B1734,,,,,,,,,,,,,0,,,,,BT,taillis simples,,,1470,1.15778,43.073037
2021-115968,2021-12-01,000001,Vente,6000,,,AUBY,B002,09230,09158,Lasserre,09,,,091580000B1882,,,,,,,,,,,,,0,,,,,BT,taillis simples,,,2799,1.157241,43.072914
2021-115968,2021-12-01,000001,Vente,6000,,,AUBY,B002,09230,09158,Lasserre,09,,,091580000B1884,,,,,,,,,,,,,0,,,,,BT,taillis simples,,,4458,1.156811,43.072619
2021-115968,2021-12-01,000001,Vente,6000,,,AUBY,B002,09230,09158,Lasserre,09,,,091580000B1885,,,,,,,,,,,,,0,,,,,BT,taillis simples,,,7482,1.156913,43.072103
2021-115968,2021-12-01,000001,Vente,6000,,,AUBY,B002,09230,09158,Lasserre,09,,,091580000B1887,,,,,,,,,,,,,0,,,,,BT,taillis simples,,,580,1.156234,43.072507
2021-115968,2021-12-01,000001,Vente,6000,,,AUBY,B002,09230,09158,Lasserre,09,,,091580000B1888,,,,,,,,,,,,,0,,,,,BT,taillis simples,,,144,1.156124,43.072028
2021-115968,2021-12-01,000001,Vente,6000,,,LES CHAUMES,B010,09230,09158,Lasserre,09,,,091580000B1947,,,,,,,,,,,,,0,,,,,L,landes,,,120,1.160517,43.080107
2021-115968,2021-12-01,000001,Vente,6000,,,LES CHAUMES,B010,09230,09158,Lasserre,09,,,091580000B1948,,,,,,,,,,,,,0,,,,,L,landes,,,1359,1.159964,43.079793
2021-115968,2021-12-01,000001,Vente,6000,,,LES CHAUMES,B010,09230,09158,Lasserre,09,,,091580000B1949,,,,,,,,,,,,,0,,,,,L,landes,,,4491,1.161683,43.080786
2021-116354,2021-12-21,000001,Vente,20229.41,,,LA GRAUSSE,B018,09230,09158,Lasserre,09,,,091580000B0083,,,,,,,,,,,,,0,,,,,BT,taillis simples,,,62800,1.176263,43.087565
2021-116354,2021-12-21,000001,Vente,20229.41,,,LES CHAUMES,B010,09230,09158,Lasserre,09,,,091580000B0448,,,,,,,,,,,,,0,,,,,L,landes,,,1315,1.163236,43.081548
2021-116354,2021-12-21,000001,Vente,20229.41,,,LES CHAUMES,B010,09230,09158,Lasserre,09,,,091580000B1984,,,,,,,,,,,,,0,,,,,L,landes,,,1037,1.165895,43.081004
2021-116354,2021-12-21,000001,Vente,20229.41,,,LES CHAUMES,B010,09230,09158,Lasserre,09,,,091580000B1985,,,,,,,,,,,,,0,,,,,L,landes,,,4833,1.165869,43.081194
2021-116354,2021-12-21,000001,Vente,20229.41,,,LES CHAUMES,B010,09230,09158,Lasserre,09,,,091580000B1986,,,,,,,,,,,,,0,,,,,L,landes,,,695,1.165975,43.080962
