id_mutation,date_mutation,numero_disposition,nature_mutation,valeur_fonciere,adresse_numero,adresse_suffixe,adresse_nom_voie,adresse_code_voie,code_postal,code_commune,nom_commune,code_departement,ancien_code_commune,ancien_nom_commune,id_parcelle,ancien_id_parcelle,numero_volume,lot1_numero,lot1_surface_carrez,lot2_numero,lot2_surface_carrez,lot3_numero,lot3_surface_carrez,lot4_numero,lot4_surface_carrez,lot5_numero,lot5_surface_carrez,nombre_lots,code_type_local,type_local,surface_reelle_bati,nombre_pieces_principales,code_nature_culture,nature_culture,code_nature_culture_speciale,nature_culture_speciale,surface_terrain,longitude,latitude
2021-110474,2021-01-22,000001,Vente,3000,,,LAS BOURDENES ET CLANET,B042,09230,09198,Montardit,09,,,091980000A0920,,,,,,,,,,,,,0,,,,,T,terres,,,510,1.188398,43.080293
2021-110474,2021-01-22,000001,Vente,3000,,,LAS BOURDENES ET CLANET,B042,09230,09198,Montardit,09,,,091980000A0928,,,,,,,,,,,,,0,,,,,T,terres,,,2500,1.187743,43.080921
2021-110474,2021-01-22,000001,Vente,3000,,,LAS BOURDENES ET CLANET,B042,09230,09198,Montardit,09,,,091980000A0929,,,,,,,,,,,,,0,,,,,P,prés,,,2360,1.187745,43.080538
2021-110474,2021-01-22,000001,Vente,3000,,,LAS BOURDENES ET CLANET,B042,09230,09198,Montardit,09,,,091980000A0935,,,,,,,,,,,,,0,,,,,T,terres,,,2885,1.186332,43.080842
2021-110474,2021-01-22,000001,Vente,3000,,,LAS BOURDENES ET CLANET,B042,09230,09198,Montardit,09,,,091980000A0937,,,,,,,,,,,,,0,,,,,T,terres,,,3165,1.18582,43.080759
2021-110474,2021-01-22,000001,Vente,3000,,,LAS BOURDENES ET CLANET,B042,09230,09198,Montardit,09,,,091980000A0942,,,,,,,,,,,,,0,,,,,T,terres,,,2895,1.183379,43.081307
2021-111680,2021-03-23,000001,Vente,250000,,,LES ROUQUETTES,B058,09230,09198,Montardit,09,,,091980000B0739,,,,,,,,,,,,,0,,,,,BT,taillis simples,,,375,1.194226,43.072542
2021-111680,2021-03-23,000001,Vente,250000,590,,LES ROUQUETTES,B058,09230,09198,Montardit,09,,,091980000B0744,,,,,,,,,,,,,0,1,Maison,140,5,BT,taillis simples,,,2132,1.194788,43.072552
2021-111680,2021-03-23,000001,Vente,250000,,,LES ROUQUETTES,B058,09230,09198,Montardit,09,,,091980000B0756,,,,,,,,,,,,,0,,,,,T,terres,,,262,1.194999,43.072495
2021-112584,2021-05-26,000001,Vente,3200,,,LIAU ET SOULEILLA,B045,09230,09198,Montardit,09,,,091980000C0270,,,,,,,,,,,,,0,,,,,L,landes,,,14730,1.183015,43.059909
2021-112584,2021-05-26,000001,Vente,3200,,,LIAU ET SOULEILLA,B045,09230,09198,Montardit,09,,,091980000C0272,,,,,,,,,,,,,0,,,,,L,landes,,,205,1.183672,43.059476
2021-112584,2021-05-26,000001,Vente,3200,,,CARREROT ET BARRADAS,B014,09230,09198,Montardit,09,,,091980000C0764,,,,,,,,,,,,,0,,,,,BT,taillis simples,,,3285,1.176383,43.053274
2021-112584,2021-05-26,000001,Vente,3200,,,CARREROT ET BARRADAS,B014,09230,09198,Montardit,09,,,091980000C0765,,,,,,,,,,,,,0,,,,,P,prés,,,1170,1.176545,43.053103
2021-112584,2021-05-26,000001,Vente,3200,,,CARREROT ET BARRADAS,B014,09230,09198,Montardit,09,,,091980000C0766,,,,,,,,,,,,,0,,,,,P,prés,,,1910,1.176069,43.053007
2021-112584,2021-05-26,000001,Vente,3200,,,CARREROT ET BARRADAS,B014,09230,09198,Montardit,09,,,091980000C0767,,,,,,,,,,,,,0,,,,,T,terres,,,3315,1.175678,43.053388
2021-112756,2021-06-07,000001,Vente,157500,,,COUSINETS HAMEAU,B022,09230,09198,Montardit,09,,,091980000A0369,,,,,,,,,,,,,0,,,,,P,prés,,,418,1.192072,43.078231
2021-112756,2021-06-07,000001,Vente,157500,63,,COUSINETS HAMEAU,B022,09230,09198,Montardit,09,,,091980000A0371,,,,,,,,,,,,,0,1,Maison,120,5,S,sols,,,825,1.192271,43.078324
2021-112756,2021-06-07,000001,Vente,157500,,,COUSINETS HAMEAU,B022,09230,09198,Montardit,09,,,091980000A0372,,,,,,,,,,,,,0,,,,,S,sols,,,45,1.192406,43.078302
2021-112756,2021-06-07,000001,Vente,157500,,,COUSINETS HAMEAU,B022,09230,09198,Montardit,09,,,091980000A0373,,,,,,,,,,,,,0,,,,,S,sols,,,180,1.192427,43.078229
2021-112756,2021-06-07,000001,Vente,157500,,,COUSINETS HAMEAU,B022,09230,09198,Montardit,09,,,091980000A0374,,,,,,,,,,,,,0,,,,,S,sols,,,42,1.192532,43.078332
2021-112756,2021-06-07,000001,Vente,157500,,,PERRINE ET MATHALI,B051,09230,09198,Montardit,09,,,091980000A0584,,,,,,,,,,,,,0,,,,,P,prés,,,540,1.191817,43.078523
2021-112756,2021-06-07,000001,Vente,157500,,,PERRINE ET MATHALI,B051,09230,09198,Montardit,09,,,091980000A0644,,,,,,,,,,,,,0,,,,,J,jardins,,,435,1.191989,43.077992
2021-114549,2021-09-18,000001,Vente,45000,,,LE FORT,B027,09230,09198,Montardit,09,,,091980000A0542,,,,,,,,,,,,,0,,,,,S,sols,,,329,1.189373,43.080011
2021-114549,2021-09-18,000001,Vente,45000,,,LE FORT,B027,09230,09198,Montardit,09,,,091980000A0543,,,,,,,,,,,,,0,,,,,J,jardins,,,413,1.189647,43.080022
2021-114549,2021-09-18,000001,Vente,45000,89,,LE FORT,B027,09230,09198,Montardit,09,,,091980000A1514,,,,,,,,,,,,,0,1,Maison,35,2,S,sols,,,309,1.189417,43.080155
2021-114724,2021-09-28,000001,Vente,15000,,,LA GRAND PIECE,B033,09230,09198,Montardit,09,,,091980000C0921,,,,,,,,,,,,,0,,,,,T,terres,,,15985,1.16234,43.055463
2021-114876,2021-10-07,000001,Vente,70000,,,MATHILOT,B048,09230,09198,Montardit,09,,,091980000C0682,,,,,,,,,,,,,0,,,,,L,landes,,,505,1.181328,43.053281
2021-114876,2021-10-07,000001,Vente,70000,,,MATHILOT,B048,09230,09198,Montardit,09,,,091980000C0683,,,,,,,,,,,,,0,,,,,L,landes,,,195,1.181136,43.053306
2021-114876,2021-10-07,000001,Vente,70000,,,MATHILOT,B048,09230,09198,Montardit,09,,,091980000C0685,,,,,,,,,,,,,0,,,,,L,landes,,,740,1.181155,43.053839
2021-114876,2021-10-07,000001,Vente,70000,105,,MATHILOT,B048,09230,09198,Montardit,09,,,091980000C0687,,,,,,,,,,,,,0,1,Maison,68,2,S,sols,,,535,1.180877,43.053467
2021-114876,2021-10-07,000001,Vente,70000,,,MATHILOT,B048,09230,09198,Montardit,09,,,091980000C0688,,,,,,,,,,,,,0,,,,,P,prés,,,670,1.180359,43.053554
2021-114876,2021-10-07,000001,Vente,70000,,,MATHILOT,B048,09230,09198,Montardit,09,,,091980000C0696,,,,,,,,,,,,,0,,,,,J,jardins,,,580,1.179965,43.053692
2021-114876,2021-10-07,000001,Vente,70000,,,MATHILOT,B048,09230,09198,Montardit,09,,,091980000C0698,,,,,,,,,,,,,0,,,,,P,prés,,,1455,1.179635,43.053565
2021-115558,2021-10-28,000001,Vente,3000,,,VIGNAOUEZE,B062,09230,09198,Montardit,09,,,091980000C0801,,,,,,,,,,,,,0,,,,,T,terres,,,965,1.174208,43.052989
2021-115558,2021-10-28,000001,Vente,3000,,,VIGNAOUEZE,B062,09230,09198,Montardit,09,,,091980000C0803,,,,,,,,,,,,,0,,,,,P,prés,,,5655,1.172578,43.053233
2021-115558,2021-10-28,000001,Vente,3000,,,VIGNAOUEZE,B062,09230,09198,Montardit,09,,,091980000C0804,,,,,,,,,,,,,0,,,,,T,terres,,,3870,1.173222,43.052647
2021-115558,2021-10-28,000001,Vente,3000,,,VIGNAOUEZE,B062,09230,09198,Montardit,09,,,091980000C0805,,,,,,,,,,,,,0,,,,,P,prés,,,4410,1.171919,43.052869
2021-115560,2021-10-28,000001,Vente,800,,,LAS BOURDENES ET CLANET,B042,09230,09198,Montardit,09,,,091980000A0864,,,,,,,,,,,,,0,,,,,T,terres,,,3015,1.182854,43.080154
2021-115968,2021-12-01,000001,Vente,6000,,,LAFICHE ET LAFONT,B039,09230,09198,Montardit,09,,,091980000A0952,,,,,,,,,,,,,0,,,,,T,terres,,,1160,1.176437,43.078483
2021-116371,2021-12-23,000001,Vente,48850,,,MATHILOT,B048,09230,09198,Montardit,09,,,091980000C0684,,,,,,,,,,,,,0,,,,,L,landes,,,245,1.181219,43.05352
2021-116371,2021-12-23,000001,Vente,48850,106,,MATHILOT,B048,09230,09198,Montardit,09,,,091980000C0686,,,,,,,,,,,,,0,1,Maison,80,3,S,sols,,,285,1.180967,43.053587
2021-116371,2021-12-23,000001,Vente,48850,,,MATHILOT,B048,09230,09198,Montardit,09,,,091980000C0689,,,,,,,,,,,,,0,,,,,P,prés,,,1745,1.180746,43.053828
2021-116371,2021-12-23,000001,Vente,48850,,,MATHILOT,B048,09230,09198,Montardit,09,,,091980000C0691,,,,,,,,,,,,,0,,,,,P,prés,,,600,1.180358,43.053916
2021-116371,2021-12-23,000001,Vente,48850,,,MATHILOT,B048,09230,09198,Montardit,09,,,091980000C0695,,,,,,,,,,,,,0,,,,,J,jardins,,,425,1.180188,43.053767
2021-116471,2021-12-29,000001,Vente,2500,,,LE FORT,B027,09230,09198,Montardit,09,,,091980000A0526,,,,,,,,,,,,,0,,,,,P,prés,,,255,1.189684,43.08021
