id_mutation,date_mutation,numero_disposition,nature_mutation,valeur_fonciere,adresse_numero,adresse_suffixe,adresse_nom_voie,adresse_code_voie,code_postal,code_commune,nom_commune,code_departement,ancien_code_commune,ancien_nom_commune,id_parcelle,ancien_id_parcelle,numero_volume,lot1_numero,lot1_surface_carrez,lot2_numero,lot2_surface_carrez,lot3_numero,lot3_surface_carrez,lot4_numero,lot4_surface_carrez,lot5_numero,lot5_surface_carrez,nombre_lots,code_type_local,type_local,surface_reelle_bati,nombre_pieces_principales,code_nature_culture,nature_culture,code_nature_culture_speciale,nature_culture_speciale,surface_terrain,longitude,latitude
2021-117965,2021-02-25,000001,Vente,1600,,,LA VALOTTE,B064,10140,10008,Argançon,10,,,100080000B0497,,,,,,,,,,,,,0,,,,,BS,taillis sous futaie,,,704,4.587903,48.244159
2021-117965,2021-02-25,000001,Vente,1600,,,LA VALOTTE,B064,10140,10008,Argançon,10,,,100080000B0499,,,,,,,,,,,,,0,,,,,BS,taillis sous futaie,,,832,4.588151,48.244124
2021-117965,2021-02-25,000001,Vente,1600,,,TERRES DES RENTES,B058,10140,10008,Argançon,10,,,100080000C0061,,,,,,,,,,,,,0,,,,,BS,taillis sous futaie,,,561,4.60309,48.257922
2021-117965,2021-02-25,000001,Vente,1600,,,VIGNES DE LA RUE,B067,10140,10008,Argançon,10,,,100080000C0259,,,,,,,,,,,,,0,,,,,BS,taillis sous futaie,,,312,4.597369,48.25461
2021-117965,2021-02-25,000001,Vente,1600,,,LES CLOCHERS,B022,10140,10008,Argançon,10,,,100080000C0594,,,,,,,,,,,,,0,,,,,BS,taillis sous futaie,,,1127,4.601322,48.251613
2021-117965,2021-02-25,000001,Vente,1600,,,LES CLOCHERS,B022,10140,10008,Argançon,10,,,100080000C0596,,,,,,,,,,,,,0,,,,,BS,taillis sous futaie,,,2502,4.60158,48.252169
2021-117965,2021-02-25,000001,Vente,1600,,,LES RENVERS DE LA RUE,B051,10140,10008,Argançon,10,,,100080000C0707,,,,,,,,,,,,,0,,,,,BS,taillis sous futaie,,,580,4.599723,48.254264
2021-117965,2021-02-25,000001,Vente,1600,,,GRATTEPET,B034,10140,10008,Argançon,10,,,100080000D0116,,,,,,,,,,,,,0,,,,,BS,taillis sous futaie,,,1889,4.612642,48.255291
2021-117965,2021-02-25,000001,Vente,1600,,,GRATTEPET,B034,10140,10008,Argançon,10,,,100080000D0158,,,,,,,,,,,,,0,,,,,BS,taillis sous futaie,,,714,4.61579,48.256152
2021-117965,2021-02-25,000001,Vente,1600,,,LE VAL LOUIS,B062,10140,10008,Argançon,10,,,100080000D0224,,,,,,,,,,,,,0,,,,,BS,taillis sous futaie,,,226,4.616446,48.253166
2021-117965,2021-02-25,000001,Vente,1600,,,GRELET,B035,10140,10008,Argançon,10,,,100080000D0720,,,,,,,,,,,,,0,,,,,BS,taillis sous futaie,,,318,4.613208,48.246405
2021-117965,2021-02-25,000001,Vente,1600,,,GRELET,B035,10140,10008,Argançon,10,,,100080000D0740,,,,,,,,,,,,,0,,,,,BS,taillis sous futaie,,,883,4.614678,48.244996
2021-118476,2021-04-09,000001,Vente,180000,,,RUE DES CANNES,B053,10140,10008,Argançon,10,,,100080000C0997,,,,,,,,,,,,,0,,,,,S,sols,,,152,4.604381,48.250183
2021-118476,2021-04-09,000001,Vente,180000,35,,RUE PRINCIPALE,0012,10140,10008,Argançon,10,,,100080000C0998,,,,,,,,,,,,,0,1,Maison,85,2,S,sols,,,223,4.604334,48.250052
2021-118476,2021-04-09,000001,Vente,180000,,,RUE DES CANNES,B053,10140,10008,Argançon,10,,,100080000C0999,,,,,,,,,,,,,0,,,,,J,jardins,,,1151,4.604468,48.250013
2021-118476,2021-04-09,000001,Vente,180000,,,RUE DES CANNES,B053,10140,10008,Argançon,10,,,100080000C0999,,,,,,,,,,,,,0,,,,,S,sols,,,24,4.604468,48.250013
2021-118476,2021-04-09,000001,Vente,180000,,,CHAMP SAINT-BRIX,B017,10140,10008,Argançon,10,,,100080000C1090,,,,,,,,,,,,,0,,,,,T,terres,,,1929,4.604694,48.249539
2021-121867,2021-07-22,000001,Vente,106300,,,LES BAS,B004,10140,10008,Argançon,10,,,10008000ZE0004,,,,,,,,,,,,,0,,,,,T,terres,,,1520,4.608372,48.257163
2021-121867,2021-07-22,000001,Vente,106300,,,LES BAS,B004,10140,10008,Argançon,10,,,10008000ZE0005,,,,,,,,,,,,,0,,,,,T,terres,,,720,4.608212,48.257129
2021-121867,2021-07-22,000001,Vente,106300,,,LES BAS,B004,10140,10008,Argançon,10,,,10008000ZE0030,,,,,,,,,,,,,0,,,,,T,terres,,,5230,4.608641,48.257434
2021-121867,2021-07-22,000001,Vente,106300,,,LES BAS,B004,10140,10008,Argançon,10,,,10008000ZE0030,,,,,,,,,,,,,0,,,,,L,landes,,,860,4.608641,48.257434
2021-122109,2021-08-13,000001,Vente,115000,42,,RUE PRINCIPALE,0012,10140,10008,Argançon,10,,,100080000C0954,,,,,,,,,,,,,0,1,Maison,68,2,S,sols,,,416,4.603763,48.253727
2021-122109,2021-08-13,000001,Vente,115000,42,,RUE PRINCIPALE,0012,10140,10008,Argançon,10,,,100080000C0954,,,,,,,,,,,,,0,3,Dépendance,,0,S,sols,,,416,4.603763,48.253727
2021-122109,2021-08-13,000001,Vente,115000,42,,RUE PRINCIPALE,0012,10140,10008,Argançon,10,,,100080000C0954,,,,,,,,,,,,,0,3,Dépendance,,0,S,sols,,,416,4.603763,48.253727
2021-122109,2021-08-13,000001,Vente,115000,42,,RUE PRINCIPALE,0012,10140,10008,Argançon,10,,,100080000C0957,,,,,,,,,,,,,0,,,,,S,sols,,,177,4.603791,48.253831
2021-122290,2021-08-03,000001,Vente,30000,,,RUE DU MOULIN,B055,10140,10008,Argançon,10,,,100080000C1072,,,,,,,,,,,,,0,,,,,VE,vergers,,,598,4.604542,48.252974
2021-122290,2021-08-03,000001,Vente,30000,25,,RUE PRINCIPALE,0012,10140,10008,Argançon,10,,,100080000C1073,,,,,,,,,,,,,0,1,Maison,105,3,S,sols,,,550,4.604166,48.252885
2021-122290,2021-08-03,000001,Vente,30000,25,,RUE PRINCIPALE,0012,10140,10008,Argançon,10,,,100080000C1073,,,,,,,,,,,,,0,3,Dépendance,,0,S,sols,,,550,4.604166,48.252885
2021-122290,2021-08-03,000001,Vente,30000,25,,RUE PRINCIPALE,0012,10140,10008,Argançon,10,,,100080000C1073,,,,,,,,,,,,,0,3,Dépendance,,0,S,sols,,,550,4.604166,48.252885
2021-122290,2021-08-03,000001,Vente,30000,25,,RUE PRINCIPALE,0012,10140,10008,Argançon,10,,,100080000C1073,,,,,,,,,,,,,0,3,Dépendance,,0,S,sols,,,550,4.604166,48.252885
2021-122290,2021-08-03,000001,Vente,30000,,,LES PETITS PRES,B044,10140,10008,Argançon,10,,,100080000C1081,,,,,,,,,,,,,0,,,,,VE,vergers,,,940,4.60511,48.252799
2021-123237,2021-10-02,000001,Vente,36540,,,AU DESSUS DE BOUZINVAUX,B027,10140,10008,Argançon,10,,,100080000B0212,,,,,,,,,,,,,0,,,,,BS,taillis sous futaie,,,4881,4.594927,48.244408
2021-123237,2021-10-02,000001,Vente,36540,,,LE VAL PITOIS,B063,10140,10008,Argançon,10,,,100080000B0409,,,,,,,,,,,,,0,,,,,T,terres,,,2143,4.591644,48.245873
2021-123237,2021-10-02,000001,Vente,36540,,,LA VALOTTE,B064,10140,10008,Argançon,10,,,100080000B0526,,,,,,,,,,,,,0,,,,,BS,taillis sous futaie,,,2940,4.584329,48.247425
2021-123237,2021-10-02,000001,Vente,36540,,,LA VALOTTE,B064,10140,10008,Argançon,10,,,100080000B0529,,,,,,,,,,,,,0,,,,,BS,taillis sous futaie,,,3440,4.583872,48.246984
2021-123237,2021-10-02,000001,Vente,36540,,,LA VALOTTE,B064,10140,10008,Argançon,10,,,100080000B0530,,,,,,,,,,,,,0,,,,,BS,taillis sous futaie,,,3560,4.583558,48.246889
2021-123237,2021-10-02,000001,Vente,36540,,,LA PIECE ARNOUT,B046,10140,10008,Argançon,10,,,100080000B0565,,,,,,,,,,,,,0,,,,,T,terres,,,1850,4.588672,48.242403
2021-123237,2021-10-02,000001,Vente,36540,,,LA PIECE ARNOUT,B046,10140,10008,Argançon,10,,,100080000B0567,,,,,,,,,,,,,0,,,,,BS,taillis sous futaie,,,1513,4.588981,48.242599
2021-123237,2021-10-02,000001,Vente,36540,,,LA PIECE ARNOUT,B046,10140,10008,Argançon,10,,,100080000B0568,,,,,,,,,,,,,0,,,,,BS,taillis sous futaie,,,748,4.588988,48.242652
2021-123237,2021-10-02,000001,Vente,36540,,,LE FOND DE BOUZINVAUX,B030,10140,10008,Argançon,10,,,100080000B0576,,,,,,,,,,,,,0,,,,,BS,taillis sous futaie,,,1439,4.591358,48.243651
2021-123237,2021-10-02,000001,Vente,36540,,,AU DESSUS DE BOUZINVAUX,B027,10140,10008,Argançon,10,,,100080000B0649,,,,,,,,,,,,,0,,,,,BS,taillis sous futaie,,,1460,4.595224,48.244233
2021-123237,2021-10-02,000001,Vente,36540,,,TERRES DES RENTES,B058,10140,10008,Argançon,10,,,100080000C0043,,,,,,,,,,,,,0,,,,,BS,taillis sous futaie,,,1437,4.601888,48.256962
2021-123237,2021-10-02,000001,Vente,36540,,,LES TROUS MARTINS,B059,10140,10008,Argançon,10,,,100080000C0366,,,,,,,,,,,,,0,,,,,BS,taillis sous futaie,,,1200,4.600544,48.249611
2021-123237,2021-10-02,000001,Vente,36540,,,LES CLOCHERS,B022,10140,10008,Argançon,10,,,100080000C0609,,,,,,,,,,,,,0,,,,,BS,taillis sous futaie,,,895,4.601323,48.253202
2021-123237,2021-10-02,000001,Vente,36540,,,LES CLOCHERS,B022,10140,10008,Argançon,10,,,100080000C0610,,,,,,,,,,,,,0,,,,,BS,taillis sous futaie,,,570,4.601284,48.253086
2021-123237,2021-10-02,000001,Vente,36540,,,RENVERS,B050,10140,10008,Argançon,10,,,100080000C0713,,,,,,,,,,,,,0,,,,,BS,taillis sous futaie,,,980,4.600168,48.253784
2021-123237,2021-10-02,000001,Vente,36540,,,LES RENVERS DE LA RUE,B051,10140,10008,Argançon,10,,,100080000C0714,,,,,,,,,,,,,0,,,,,BS,taillis sous futaie,,,347,4.600237,48.254113
2021-123237,2021-10-02,000001,Vente,36540,,,LES RENVERS DE LA RUE,B051,10140,10008,Argançon,10,,,100080000C0715,,,,,,,,,,,,,0,,,,,BS,taillis sous futaie,,,264,4.600195,48.254437
2021-123237,2021-10-02,000001,Vente,36540,,,LES RENVERS DE LA RUE,B051,10140,10008,Argançon,10,,,100080000C0716,,,,,,,,,,,,,0,,,,,BS,taillis sous futaie,,,461,4.600309,48.254423
2021-123237,2021-10-02,000001,Vente,36540,,,LES RENVERS DE LA RUE,B051,10140,10008,Argançon,10,,,100080000C0718,,,,,,,,,,,,,0,,,,,BS,taillis sous futaie,,,180,4.600332,48.253769
2021-123237,2021-10-02,000001,Vente,36540,,,LES RENVERS DE LA RUE,B051,10140,10008,Argançon,10,,,100080000C0719,,,,,,,,,,,,,0,,,,,BS,taillis sous futaie,,,195,4.600395,48.253766
2021-123237,2021-10-02,000001,Vente,36540,,,LES CLOCHERS,B022,10140,10008,Argançon,10,,,100080000C0784,,,,,,,,,,,,,0,,,,,BS,taillis sous futaie,,,918,4.601332,48.252949
2021-123237,2021-10-02,000001,Vente,36540,,,LES BATARDS,B006,10140,10008,Argançon,10,,,100080000D0054,,,,,,,,,,,,,0,,,,,L,landes,,,642,4.611804,48.256581
2021-123237,2021-10-02,000001,Vente,36540,,,LES BATARDS,B006,10140,10008,Argançon,10,,,100080000D0056,,,,,,,,,,,,,0,,,,,BS,taillis sous futaie,,,1977,4.61126,48.256773
2021-123237,2021-10-02,000001,Vente,36540,,,GRELET,B035,10140,10008,Argançon,10,,,100080000D0656,,,,,,,,,,,,,0,,,,,BS,taillis sous futaie,,,634,4.616824,48.242198
2021-123237,2021-10-02,000001,Vente,36540,,,GRELET,B035,10140,10008,Argançon,10,,,100080000D0664,,,,,,,,,,,,,0,,,,,BS,taillis sous futaie,,,997,4.617049,48.242647
2021-123237,2021-10-02,000001,Vente,36540,,,GRELET,B035,10140,10008,Argançon,10,,,100080000D0665,,,,,,,,,,,,,0,,,,,BS,taillis sous futaie,,,536,4.617055,48.242696
2021-123237,2021-10-02,000001,Vente,36540,,,GRELET,B035,10140,10008,Argançon,10,,,100080000D0676,,,,,,,,,,,,,0,,,,,BS,taillis sous futaie,,,1142,4.616667,48.243304
2021-123237,2021-10-02,000001,Vente,36540,,,LE FOND DE BOUZINVAUX,B030,10140,10008,Argançon,10,,,10008000ZC0060,,,,,,,,,,,,,0,,,,,BS,taillis sous futaie,,,781,4.595123,48.24271
2021-124114,2021-10-29,000001,Vente,154740,48,,RUE PRINCIPALE,0012,10140,10008,Argançon,10,,,100080000C0297,,,,,,,,,,,,,0,1,Maison,140,4,S,sols,,,788,4.603745,48.253377
2021-124114,2021-10-29,000001,Vente,154740,,,LES RANDONS,B049,10140,10008,Argançon,10,,,100080000C0898,,,,,,,,,,,,,0,,,,,S,sols,,,124,4.60371,48.253465
2021-124503,2021-11-24,000001,Vente,95000,,,VIGNES DES MOINES,B068,10140,10008,Argançon,10,,,100080000C0801,,,,,,,,,,,,,0,,,,,S,sols,,,41,4.607358,48.258582
2021-124503,2021-11-24,000001,Vente,95000,,,VIGNES DES MOINES,B068,10140,10008,Argançon,10,,,100080000C0803,,,,,,,,,,,,,0,,,,,S,sols,,,36,4.607318,48.258528
2021-124503,2021-11-24,000001,Vente,95000,4,,RUE PRINCIPALE,0012,10140,10008,Argançon,10,,,100080000C0949,,,,,,,,,,,,,0,,,,,J,jardins,,,643,4.607479,48.25853
2021-124503,2021-11-24,000001,Vente,95000,4,,RUE PRINCIPALE,0012,10140,10008,Argançon,10,,,100080000C0949,,,,,,,,,,,,,0,,,,,S,sols,,,500,4.607479,48.25853
2021-124797,2021-11-29,000001,Vente,139900,29,,RUE PRINCIPALE,0012,10140,10008,Argançon,10,,,100080000C0979,,,,,,,,,,,,,0,1,Maison,112,4,S,sols,,,870,4.604293,48.25189
2021-124797,2021-11-29,000001,Vente,139900,,,RUE DES CANNES,B053,10140,10008,Argançon,10,,,100080000C0980,,,,,,,,,,,,,0,,,,,S,sols,,,249,4.604238,48.251741
