id_mutation,date_mutation,numero_disposition,nature_mutation,valeur_fonciere,adresse_numero,adresse_suffixe,adresse_nom_voie,adresse_code_voie,code_postal,code_commune,nom_commune,code_departement,ancien_code_commune,ancien_nom_commune,id_parcelle,ancien_id_parcelle,numero_volume,lot1_numero,lot1_surface_carrez,lot2_numero,lot2_surface_carrez,lot3_numero,lot3_surface_carrez,lot4_numero,lot4_surface_carrez,lot5_numero,lot5_surface_carrez,nombre_lots,code_type_local,type_local,surface_reelle_bati,nombre_pieces_principales,code_nature_culture,nature_culture,code_nature_culture_speciale,nature_culture_speciale,surface_terrain,longitude,latitude
2021-116970,2021-01-15,000001,Vente,3200,,,LE MARAIS,B104,10220,10019,Val-d'Auzon,10,,,100190000D0030,,,,,,,,,,,,,0,,,,,VE,vergers,,,1067,4.363539,48.407736
2021-119118,2021-04-23,000002,Vente,97540,3,,RTE DE LESMONT,0125,10220,10019,Val-d'Auzon,10,,,100190000D0091,,,,,,,,,,,,,0,1,Maison,90,5,S,sols,,,356,4.368845,48.404704
2021-119118,2021-04-23,000002,Vente,97540,,,PETITE CHARMOTTE,B134,10220,10019,Val-d'Auzon,10,,,100190000D0382,,,,,,,,,,,,,0,,,,,VE,vergers,,,1140,4.36872,48.404769
2021-119224,2021-04-23,000001,Vente,2915,,,PETITE CHARMOTTE,B134,10220,10019,Val-d'Auzon,10,,,100190000D0381,,,,,,,,,,,,,0,,,,,VE,vergers,,,265,4.368458,48.404961
2021-120202,2021-01-12,000001,Adjudication,36000,1,,GR GRANDE RUE (AUZON),0095,10220,10019,Val-d'Auzon,10,,,100190000D0353,,,,,,,,,,,,,0,1,Maison,64,3,S,sols,,,444,4.362217,48.40665
2021-120487,2021-06-14,000001,Vente,166150,7,,RUE CORNUE,0041,10220,10019,Val-d'Auzon,10,,,10019244ZT0075,,,,,,,,,,,,,0,1,Maison,99,3,S,sols,,,1000,4.345414,48.40104
2021-120487,2021-06-14,000001,Vente,166150,7,,RUE CORNUE,0041,10220,10019,Val-d'Auzon,10,,,10019244ZT0075,,,,,,,,,,,,,0,1,Maison,99,3,T,terres,,,1883,4.345414,48.40104
2021-121101,2021-07-07,000001,Vente,2000,,,LES SILLONS,B162,10220,10019,Val-d'Auzon,10,,,100192440E0135,,,,,,,,,,,,,0,,,,,BP,peupleraies,,,2480,4.349961,48.389014
2021-121990,2021-07-30,000001,Vente,140000,,,PRES DE LA CORVEE,B143,10220,10019,Val-d'Auzon,10,,,10019413ZK0001,,,,,,,,,,,,,0,,,,,T,terres,,,15650,4.386234,48.374607
2021-121990,2021-07-30,000001,Vente,140000,2,,RTE DE BREVONNES,0024,10220,10019,Val-d'Auzon,10,,,10019413ZK0002,,,,,,,,,,,,,0,1,Maison,73,4,S,sols,,,3240,4.38587,48.37534
2021-121990,2021-07-30,000001,Vente,140000,2,,RTE DE BREVONNES,0024,10220,10019,Val-d'Auzon,10,,,10019413ZK0002,,,,,,,,,,,,,0,3,Dépendance,,0,S,sols,,,3240,4.38587,48.37534
2021-122217,2021-08-24,000001,Vente,234000,1,,RUE CORNUE,0041,10220,10019,Val-d'Auzon,10,,,100192440D0559,,,,,,,,,,,,,0,1,Maison,128,5,S,sols,,,500,4.345942,48.400235
2021-122217,2021-08-24,000001,Vente,234000,1,,RUE CORNUE,0041,10220,10019,Val-d'Auzon,10,,,100192440D0559,,,,,,,,,,,,,0,3,Dépendance,,0,S,sols,,,500,4.345942,48.400235
2021-122217,2021-08-24,000001,Vente,234000,1,,RUE CORNUE,0041,10220,10019,Val-d'Auzon,10,,,100192440D0559,,,,,,,,,,,,,0,3,Dépendance,,0,S,sols,,,500,4.345942,48.400235
2021-122217,2021-08-24,000001,Vente,234000,1,,RUE CORNUE,0041,10220,10019,Val-d'Auzon,10,,,100192440D0559,,,,,,,,,,,,,0,1,Maison,128,5,VE,vergers,,,1337,4.345942,48.400235
2021-122217,2021-08-24,000001,Vente,234000,1,,RUE CORNUE,0041,10220,10019,Val-d'Auzon,10,,,100192440D0559,,,,,,,,,,,,,0,3,Dépendance,,0,VE,vergers,,,1337,4.345942,48.400235
2021-122217,2021-08-24,000001,Vente,234000,1,,RUE CORNUE,0041,10220,10019,Val-d'Auzon,10,,,100192440D0559,,,,,,,,,,,,,0,3,Dépendance,,0,VE,vergers,,,1337,4.345942,48.400235
2021-122249,2021-08-31,000001,Vente,340000,30,,GR GRANDE RUE (MONTANGON),0097,10220,10019,Val-d'Auzon,10,,,100192440D0588,,,,,,,,,,,,,0,3,Dépendance,,0,S,sols,,,2000,4.34806,48.399929
2021-122249,2021-08-31,000001,Vente,340000,30,,GR GRANDE RUE (MONTANGON),0097,10220,10019,Val-d'Auzon,10,,,100192440D0588,,,,,,,,,,,,,0,1,Maison,238,5,VE,vergers,,,4176,4.34806,48.399929
2021-122249,2021-08-31,000001,Vente,340000,30,,GR GRANDE RUE (MONTANGON),0097,10220,10019,Val-d'Auzon,10,,,100192440D0588,,,,,,,,,,,,,0,1,Maison,238,5,S,sols,,,2000,4.34806,48.399929
2021-122249,2021-08-31,000001,Vente,340000,30,,GR GRANDE RUE (MONTANGON),0097,10220,10019,Val-d'Auzon,10,,,100192440D0588,,,,,,,,,,,,,0,3,Dépendance,,0,VE,vergers,,,4176,4.34806,48.399929
2021-122249,2021-08-31,000001,Vente,340000,30,,GR GRANDE RUE (MONTANGON),0097,10220,10019,Val-d'Auzon,10,,,100192440D0588,,,,,,,,,,,,,0,3,Dépendance,,0,S,sols,,,2000,4.34806,48.399929
2021-122249,2021-08-31,000001,Vente,340000,30,,GR GRANDE RUE (MONTANGON),0097,10220,10019,Val-d'Auzon,10,,,100192440D0588,,,,,,,,,,,,,0,3,Dépendance,,0,VE,vergers,,,4176,4.34806,48.399929
2021-123271,2021-09-29,000001,Vente,30400,,,COLIN PAYOT,B181,10220,10019,Val-d'Auzon,10,,,10019244ZN0006,,,,,,,,,,,,,0,,,,,T,terres,,,4500,4.333307,48.39186
2021-124585,2021-11-24,000001,Vente,67000,1,,GR GRANDE RUE (AUZON),0095,10220,10019,Val-d'Auzon,10,,,100190000D0353,,,,,,,,,,,,,0,1,Maison,64,3,S,sols,,,444,4.362217,48.40665
2021-124798,2021-12-06,000001,Vente,60000,,,TERTRE COMTE,B166,10220,10019,Val-d'Auzon,10,,,10019244ZR0018,,,,,,,,,,,,,0,,,,,T,terres,,,49000,4.322578,48.405927
2021-125521,2021-12-01,000002,Vente,6191.2,,,CHAMP LA VEUVE,B026,10220,10019,Val-d'Auzon,10,,,100192440E0400,,,,,,,,,,,,,0,,,,,T,terres,,,7739,,
