id_mutation,date_mutation,numero_disposition,nature_mutation,valeur_fonciere,adresse_numero,adresse_suffixe,adresse_nom_voie,adresse_code_voie,code_postal,code_commune,nom_commune,code_departement,ancien_code_commune,ancien_nom_commune,id_parcelle,ancien_id_parcelle,numero_volume,lot1_numero,lot1_surface_carrez,lot2_numero,lot2_surface_carrez,lot3_numero,lot3_surface_carrez,lot4_numero,lot4_surface_carrez,lot5_numero,lot5_surface_carrez,nombre_lots,code_type_local,type_local,surface_reelle_bati,nombre_pieces_principales,code_nature_culture,nature_culture,code_nature_culture_speciale,nature_culture_speciale,surface_terrain,longitude,latitude
2021-116850,2021-01-15,000001,Vente,20000,,,LES VIGNES,B149,10700,10082,Chapelle-Vallon,10,,,100820000I0037,,,,,,,,,,,,,0,,,,,P,prés,PATUR,Pâture plantée,888,4.039477,48.437495
2021-117398,2021-02-04,000001,Vente,48000,6,,RUE DE LA LIBERTE,0078,10700,10082,Chapelle-Vallon,10,,,100820000I0017,,,,,,,,,,,,,0,3,Dépendance,,0,S,sols,,,318,4.039026,48.436447
2021-117398,2021-02-04,000001,Vente,48000,6,,RUE DE LA LIBERTE,0078,10700,10082,Chapelle-Vallon,10,,,100820000I0017,,,,,,,,,,,,,0,3,Dépendance,,0,S,sols,,,318,4.039026,48.436447
2021-117398,2021-02-04,000001,Vente,48000,6,,RUE DE LA LIBERTE,0078,10700,10082,Chapelle-Vallon,10,,,100820000I0017,,,,,,,,,,,,,0,3,Dépendance,,0,S,sols,,,318,4.039026,48.436447
2021-117398,2021-02-04,000001,Vente,48000,6,,RUE DE LA LIBERTE,0078,10700,10082,Chapelle-Vallon,10,,,100820000I0017,,,,,,,,,,,,,0,1,Maison,58,3,S,sols,,,318,4.039026,48.436447
2021-117740,2021-03-08,000001,Vente,52164,,,RUE DU COGNIOT,B129,10700,10082,Chapelle-Vallon,10,,,100820000I0284,,,,,,,,,,,,,0,,,,,T,terres,,,938,4.044125,48.435611
2021-117740,2021-03-08,000001,Vente,52164,,,RUE DU COGNIOT,B129,10700,10082,Chapelle-Vallon,10,,,100820000I0285,,,,,,,,,,,,,0,,,,,T,terres,,,925,4.044362,48.435362
2021-118160,2021-03-05,000001,Vente,50000,7,,VOIE DE TROYES,0103,10700,10082,Chapelle-Vallon,10,,,100820000I0094,,,,,,,,,,,,,0,1,Maison,72,3,S,sols,,,907,4.042382,48.434513
2021-118473,2021-03-22,000001,Vente,70000,1,,RUE DU MOULIN,0086,10700,10082,Chapelle-Vallon,10,,,100820000I0088,,,,,,,,,,,,,0,1,Maison,131,3,S,sols,,,1320,4.041084,48.435086
2021-120072,2021-06-07,000001,Vente,147000,,,VOIE DE TROYES,B152,10700,10082,Chapelle-Vallon,10,,,100820000I0440,,,,,,,,,,,,,0,,,,,S,sols,,,311,4.043353,48.434399
2021-120072,2021-06-07,000001,Vente,147000,3,,CHE DE LA CHAILLOTIERE,0008,10700,10082,Chapelle-Vallon,10,,,100820000I0441,,,,,,,,,,,,,0,1,Maison,130,4,S,sols,,,1301,4.043233,48.434605
2021-123586,2021-10-07,000001,Vente,4500,,,LE DAUPHIN,B066,10700,10082,Chapelle-Vallon,10,,,10082000ZE0051,,,,,,,,,,,,,0,,,,,T,terres,,,5020,4.041351,48.437847
2021-123989,2021-10-29,000002,Vente,140000,14,,RUE DU DAUPHIN,B130,10700,10082,Chapelle-Vallon,10,,,100820000I0481,,,,,,,,,,,,,0,,,,,S,sols,,,919,4.040783,48.436914
2021-123989,2021-10-29,000002,Vente,140000,,,RUE DU DAUPHIN,B130,10700,10082,Chapelle-Vallon,10,,,100820000I0483,,,,,,,,,,,,,0,,,,,S,sols,,,20,4.040328,48.436727
2021-124554,2021-11-10,000001,Vente,90000,14,,RUE DU MOULIN,0086,10700,10082,Chapelle-Vallon,10,,,100820000I0072,,,,,,,,,,,,,0,3,Dépendance,,0,S,sols,,,1415,4.043911,48.435751
2021-124554,2021-11-10,000001,Vente,90000,14,,RUE DU MOULIN,0086,10700,10082,Chapelle-Vallon,10,,,100820000I0072,,,,,,,,,,,,,0,1,Maison,80,3,S,sols,,,1415,4.043911,48.435751
