id_mutation,date_mutation,numero_disposition,nature_mutation,valeur_fonciere,adresse_numero,adresse_suffixe,adresse_nom_voie,adresse_code_voie,code_postal,code_commune,nom_commune,code_departement,ancien_code_commune,ancien_nom_commune,id_parcelle,ancien_id_parcelle,numero_volume,lot1_numero,lot1_surface_carrez,lot2_numero,lot2_surface_carrez,lot3_numero,lot3_surface_carrez,lot4_numero,lot4_surface_carrez,lot5_numero,lot5_surface_carrez,nombre_lots,code_type_local,type_local,surface_reelle_bati,nombre_pieces_principales,code_nature_culture,nature_culture,code_nature_culture_speciale,nature_culture_speciale,surface_terrain,longitude,latitude
2021-117902,2021-03-08,000001,Vente,32000,,,DERRIERE LE VILLAGE,B024,10400,10291,Plessis-Barbuise,10,,,10291000AA0019,,,,,,,,,,,,,0,,,,,S,sols,,,494,3.582764,48.576186
2021-117902,2021-03-08,000001,Vente,32000,3,,RUE DES CHARBONNIERS,0015,10400,10291,Plessis-Barbuise,10,,,10291000AA0021,,,,,,,,,,,,,0,1,Maison,79,3,S,sols,,,108,3.582944,48.576236
2021-120602,2021-06-30,000001,Vente,145520,,,LA RUE,B055,10400,10291,Plessis-Barbuise,10,,,102910000C0908,,,,,,,,,,,,,0,,,,,P,prés,,,791,3.575017,48.570646
2021-120602,2021-06-30,000001,Vente,145520,1,,RUE DU MOULIN,0050,10400,10291,Plessis-Barbuise,10,,,102910000C0909,,,,,,,,,,,,,0,1,Maison,216,6,S,sols,,,1018,3.574904,48.570456
2021-120602,2021-06-30,000001,Vente,145520,,,LA RUE,B055,10400,10291,Plessis-Barbuise,10,,,102910000C0911,,,,,,,,,,,,,0,,,,,J,jardins,,,167,3.575049,48.570242
2021-120602,2021-06-30,000001,Vente,145520,,,LA RUE,B055,10400,10291,Plessis-Barbuise,10,,,102910000C0914,,,,,,,,,,,,,0,,,,,VE,vergers,,,646,3.575346,48.570258
2021-121333,2021-07-12,000002,Vente,152000,12,,RUE DIEU,0027,10400,10291,Plessis-Barbuise,10,,,10291000AB0200,,,,,,,,,,,,,0,1,Maison,89,3,,,,,,3.585147,48.575622
2021-121333,2021-07-12,000002,Vente,152000,12,,RUE DIEU,0027,10400,10291,Plessis-Barbuise,10,,,10291000AB0200,,,,,,,,,,,,,0,1,Maison,120,4,,,,,,3.585147,48.575622
2021-121333,2021-07-12,000002,Vente,152000,12,,RUE DIEU,0027,10400,10291,Plessis-Barbuise,10,,,10291000AB0200,,,,,,,,,,,,,0,3,Dépendance,,0,,,,,,3.585147,48.575622
