id_mutation,date_mutation,numero_disposition,nature_mutation,valeur_fonciere,adresse_numero,adresse_suffixe,adresse_nom_voie,adresse_code_voie,code_postal,code_commune,nom_commune,code_departement,ancien_code_commune,ancien_nom_commune,id_parcelle,ancien_id_parcelle,numero_volume,lot1_numero,lot1_surface_carrez,lot2_numero,lot2_surface_carrez,lot3_numero,lot3_surface_carrez,lot4_numero,lot4_surface_carrez,lot5_numero,lot5_surface_carrez,nombre_lots,code_type_local,type_local,surface_reelle_bati,nombre_pieces_principales,code_nature_culture,nature_culture,code_nature_culture_speciale,nature_culture_speciale,surface_terrain,longitude,latitude
2021-134751,2021-10-18,000001,Vente,587625,,,CHATEAU DU MAZET,B020,11240,11108,La Courtète,11,,,111080000B0012,,,,,,,,,,,,,0,,,,,T,terres,,,3870,2.021997,43.144725
2021-134751,2021-10-18,000001,Vente,587625,,,CHATEAU DU MAZET,B020,11240,11108,La Courtète,11,,,111080000B0013,,,,,,,,,,,,,0,,,,,BT,taillis simples,,,4670,2.021562,43.144533
2021-134751,2021-10-18,000001,Vente,587625,,,CHATEAU DU MAZET,B020,11240,11108,La Courtète,11,,,111080000B0404,,,,,,,,,,,,,0,,,,,T,terres,,,135,2.02294,43.143528
2021-134751,2021-10-18,000001,Vente,587625,,,CHATEAU DU MAZET,B020,11240,11108,La Courtète,11,,,111080000B0405,,,,,,,,,,,,,0,,,,,T,terres,,,31,2.022293,43.143553
2021-134751,2021-10-18,000001,Vente,587625,,,CHATEAU DU MAZET,B020,11240,11108,La Courtète,11,,,111080000B0406,,,,,,,,,,,,,0,,,,,T,terres,,,89,2.022519,43.143545
2021-134751,2021-10-18,000001,Vente,587625,,,CHATEAU DU MAZET,B020,11240,11108,La Courtète,11,,,111080000B0407,,,,,,,,,,,,,0,,,,,T,terres,,,11,2.022385,43.143566
2021-134751,2021-10-18,000001,Vente,587625,,,CHATEAU DU MAZET,B020,11240,11108,La Courtète,11,,,111080000B0409,,,,,,,,,,,,,0,,,,,S,sols,,,84,2.022775,43.14347
2021-134751,2021-10-18,000001,Vente,587625,,,CHATEAU DU MAZET,B020,11240,11108,La Courtète,11,,,111080000B0409,,,,,,,,,,,,,0,,,,,T,terres,,,157,2.022775,43.14347
2021-134751,2021-10-18,000001,Vente,587625,16,,CHATEAU DU MAZET,B020,11240,11108,La Courtète,11,,,111080000B0412,,,,,,,,,,,,,0,1,Maison,110,3,S,sols,,,1785,2.022099,43.143433
2021-134751,2021-10-18,000001,Vente,587625,16,,CHATEAU DU MAZET,B020,11240,11108,La Courtète,11,,,111080000B0412,,,,,,,,,,,,,0,3,Dépendance,,0,S,sols,,,1785,2.022099,43.143433
2021-134751,2021-10-18,000001,Vente,587625,16,,CHATEAU DU MAZET,B020,11240,11108,La Courtète,11,,,111080000B0412,,,,,,,,,,,,,0,3,Dépendance,,0,S,sols,,,1785,2.022099,43.143433
2021-134751,2021-10-18,000001,Vente,587625,16,,CHATEAU DU MAZET,B020,11240,11108,La Courtète,11,,,111080000B0412,,,,,,,,,,,,,0,1,Maison,225,9,S,sols,,,1785,2.022099,43.143433
2021-134751,2021-10-18,000001,Vente,587625,16,,CHATEAU DU MAZET,B020,11240,11108,La Courtète,11,,,111080000B0412,,,,,,,,,,,,,0,3,Dépendance,,0,S,sols,,,1785,2.022099,43.143433
2021-134751,2021-10-18,000001,Vente,587625,,,CHATEAU DU MAZET,B020,11240,11108,La Courtète,11,,,111080000B0414,,,,,,,,,,,,,0,,,,,S,sols,,,449,2.021891,43.143195
2021-134751,2021-10-18,000001,Vente,587625,5000,,CHATEAU DU MAZET,B020,11240,11108,La Courtète,11,,,111080000B0450,,,,,,,,,,,,,0,3,Dépendance,,0,S,sols,,,1101,2.022121,43.143837
2021-134751,2021-10-18,000001,Vente,587625,5000,,CHATEAU DU MAZET,B020,11240,11108,La Courtète,11,,,111080000B0450,,,,,,,,,,,,,0,3,Dépendance,,0,T,terres,,,12039,2.022121,43.143837
2021-134751,2021-10-18,000001,Vente,587625,,,CHATEAU DU MAZET,B020,11240,11108,La Courtète,11,,,111080000B0455,,,,,,,,,,,,,0,,,,,T,terres,,,4092,2.02238,43.143109
2021-134751,2021-10-18,000001,Vente,587625,,,CHATEAU DU MAZET,B020,11240,11108,La Courtète,11,,,111080000B0458,,,,,,,,,,,,,0,,,,,T,terres,,,945,2.022426,43.14335
