id_mutation,date_mutation,numero_disposition,nature_mutation,valeur_fonciere,adresse_numero,adresse_suffixe,adresse_nom_voie,adresse_code_voie,code_postal,code_commune,nom_commune,code_departement,ancien_code_commune,ancien_nom_commune,id_parcelle,ancien_id_parcelle,numero_volume,lot1_numero,lot1_surface_carrez,lot2_numero,lot2_surface_carrez,lot3_numero,lot3_surface_carrez,lot4_numero,lot4_surface_carrez,lot5_numero,lot5_surface_carrez,nombre_lots,code_type_local,type_local,surface_reelle_bati,nombre_pieces_principales,code_nature_culture,nature_culture,code_nature_culture_speciale,nature_culture_speciale,surface_terrain,longitude,latitude
2021-128577,2021-05-20,000001,Vente,4000,,,MONSET,B022,11330,11191,Laroque-de-Fa,11,,,111910000A1597,,,,,,,,,,,,,0,,,,,L,landes,,,2230,2.565391,42.950375
2021-129579,2021-06-23,000001,Vente,126000,,,LE VILLAGE,B036,11330,11191,Laroque-de-Fa,11,,,111910000A0022,,,,,,,,,,,,,0,,,,,L,landes,,,410,2.563642,42.956846
2021-129579,2021-06-23,000001,Vente,126000,1,,CHE DU CHATEAU,0013,11330,11191,Laroque-de-Fa,11,,,111910000A1973,,,,,,,,,,,,,0,3,Dépendance,,0,S,sols,,,147,2.563771,42.95669
2021-129579,2021-06-23,000001,Vente,126000,1,,CHE DU CHATEAU,0013,11330,11191,Laroque-de-Fa,11,,,111910000A1973,,,,,,,,,,,,,0,3,Dépendance,,0,S,sols,,,147,2.563771,42.95669
2021-129579,2021-06-23,000001,Vente,126000,1,,CHE DU CHATEAU,0013,11330,11191,Laroque-de-Fa,11,,,111910000A1973,,,,,,,,,,,,,0,1,Maison,83,4,S,sols,,,147,2.563771,42.95669
2021-130988,2021-07-26,000001,Vente,71000,22,A,LE VILLAGE,B036,11330,11191,Laroque-de-Fa,11,,,111910000A0106,,,,,,,,,,,,,0,1,Maison,44,1,S,sols,,,65,2.566167,42.95707
2021-130988,2021-07-26,000001,Vente,71000,,,LE VILLAGE,B036,11330,11191,Laroque-de-Fa,11,,,111910000A1897,,,,,,,,,,,,,0,,,,,L,landes,,,313,2.56609,42.956967
2021-132641,2021-09-02,000001,Vente,138150,,,LE VILLAGE,B036,11330,11191,Laroque-de-Fa,11,,,111910000A0431,,,,,,,,,,,,,0,,,,,T,terres,,,540,2.562958,42.957134
2021-132641,2021-09-02,000001,Vente,138150,5092,,LE VILLAGE,B036,11330,11191,Laroque-de-Fa,11,,,111910000A1940,,,,,,,,,,,,,0,1,Maison,76,4,T,terres,,,901,2.562726,42.957211
2021-132641,2021-09-02,000001,Vente,138150,5092,,LE VILLAGE,B036,11330,11191,Laroque-de-Fa,11,,,111910000A1940,,,,,,,,,,,,,0,3,Dépendance,,0,S,sols,,,789,2.562726,42.957211
2021-132641,2021-09-02,000001,Vente,138150,5092,,LE VILLAGE,B036,11330,11191,Laroque-de-Fa,11,,,111910000A1940,,,,,,,,,,,,,0,1,Maison,76,4,S,sols,,,789,2.562726,42.957211
2021-132641,2021-09-02,000001,Vente,138150,5092,,LE VILLAGE,B036,11330,11191,Laroque-de-Fa,11,,,111910000A1940,,,,,,,,,,,,,0,3,Dépendance,,0,T,terres,,,901,2.562726,42.957211
2021-134906,2021-10-19,000001,Vente,45000,62,B,LE VILLAGE,B036,11330,11191,Laroque-de-Fa,11,,,111910000A1887,,,,,,,,,,,,,0,1,Maison,80,3,S,sols,,,103,2.562266,42.955935
2021-136035,2021-11-10,000001,Vente,2300,,,ROQUE NOIRE,B030,11330,11191,Laroque-de-Fa,11,,,111910000A0522,,,,,,,,,,,,,0,,,,,T,terres,,,3500,2.574282,42.964619
2021-136035,2021-11-10,000001,Vente,2300,,,ROQUE NOIRE,B030,11330,11191,Laroque-de-Fa,11,,,111910000A0523,,,,,,,,,,,,,0,,,,,T,terres,,,1450,2.574038,42.965131
2021-136035,2021-11-10,000001,Vente,2300,,,ROQUE NOIRE,B030,11330,11191,Laroque-de-Fa,11,,,111910000A0524,,,,,,,,,,,,,0,,,,,L,landes,,,1230,2.57402,42.965279
2021-136035,2021-11-10,000001,Vente,2300,,,LA GAUNA,B017,11330,11191,Laroque-de-Fa,11,,,111910000A1434,,,,,,,,,,,,,0,,,,,T,terres,,,1260,2.578285,42.967459
