id_mutation,date_mutation,numero_disposition,nature_mutation,valeur_fonciere,adresse_numero,adresse_suffixe,adresse_nom_voie,adresse_code_voie,code_postal,code_commune,nom_commune,code_departement,ancien_code_commune,ancien_nom_commune,id_parcelle,ancien_id_parcelle,numero_volume,lot1_numero,lot1_surface_carrez,lot2_numero,lot2_surface_carrez,lot3_numero,lot3_surface_carrez,lot4_numero,lot4_surface_carrez,lot5_numero,lot5_surface_carrez,nombre_lots,code_type_local,type_local,surface_reelle_bati,nombre_pieces_principales,code_nature_culture,nature_culture,code_nature_culture_speciale,nature_culture_speciale,surface_terrain,longitude,latitude
2021-125730,2021-01-07,000001,Vente,100,,,LE DEBES,B017,11300,11211,Magrie,11,,,11211000BO0042,,,,,,,,,,,,,0,,,,,L,landes,,,3640,2.192046,43.013426
2021-126708,2021-03-12,000001,Vente,80000,4,B,AV DU JUEL,0017,11300,11211,Magrie,11,,,11211000AB0056,,,,,,,,,,,,,0,1,Maison,70,3,S,sols,,,585,2.202476,43.030403
2021-126708,2021-03-12,000001,Vente,80000,,,LE PRE LONG,B044,11300,11211,Magrie,11,,,11211000AC0037,,,,,,,,,,,,,0,,,,,L,landes,,,1805,2.191162,43.026189
2021-126708,2021-03-12,000001,Vente,80000,,,LE PRE LONG,B044,11300,11211,Magrie,11,,,11211000AC0039,,,,,,,,,,,,,0,,,,,L,landes,,,575,2.191391,43.026026
2021-126708,2021-03-12,000001,Vente,80000,,,LE PLA D AL FOUR,B040,11300,11211,Magrie,11,,,11211000AL0007,,,,,,,,,,,,,0,,,,,L,landes,,,9172,2.182461,43.032827
2021-127253,2021-02-02,000001,Adjudication,12000,4,,RUE DE LA PAIX,0026,11300,11211,Magrie,11,,,11211000AA0235,,,,,,,,,,,,,0,1,Maison,60,3,S,sols,,,67,2.199951,43.027611
2021-127542,2021-04-16,000001,Vente,35000,167,,LA GARRIGUE,B025,11300,11211,Magrie,11,,,11211000AR0015,,,,,,,,,,,,,0,1,Maison,24,1,S,sols,,,200,2.216224,43.038859
2021-127542,2021-04-16,000001,Vente,35000,167,,LA GARRIGUE,B025,11300,11211,Magrie,11,,,11211000AR0015,,,,,,,,,,,,,0,1,Maison,24,1,L,landes,,,4153,2.216224,43.038859
2021-127624,2021-04-21,000001,Vente,24000,,,AV DU JUEL,0017,11300,11211,Magrie,11,,,11211000AB0026,,,,,,,,,,,,,0,,,,,J,jardins,POTAG,Jardin potager,501,2.201598,43.029026
2021-127624,2021-04-21,000001,Vente,24000,,,AV DU JUEL,0017,11300,11211,Magrie,11,,,11211000AB0026,,,,,,,,,,,,,0,,,,,VE,vergers,,,256,2.201598,43.029026
2021-127853,2021-05-03,000001,Vente,3000,,,LES GOURS,B026,11300,11211,Magrie,11,,,11211000AK0001,,,,,,,,,,,,,0,,,,,BT,taillis simples,,,263,2.185029,43.033426
2021-127853,2021-05-03,000001,Vente,3000,,,PENNER,B037,11300,11211,Magrie,11,,,11211000AL0018,,,,,,,,,,,,,0,,,,,L,landes,,,5864,2.184411,43.03373
2021-127853,2021-05-03,000001,Vente,3000,,,PENNER,B037,11300,11211,Magrie,11,,,11211000AL0069,,,,,,,,,,,,,0,,,,,BT,taillis simples,,,6816,2.184468,43.03272
2021-127853,2021-05-03,000001,Vente,3000,,,PENNER,B037,11300,11211,Magrie,11,,,11211000AL0069,,,,,,,,,,,,,0,,,,,BT,taillis simples,,,2072,2.184468,43.03272
2021-127990,2021-05-19,000001,Vente,175000,,,LE CAGNE,B008,11300,11211,Magrie,11,,,11211000AW0133,,,,,,,,,,,,,0,1,Maison,80,3,S,sols,,,478,2.204094,43.028947
2021-127990,2021-05-19,000001,Vente,175000,,,LE CAGNE,B008,11300,11211,Magrie,11,,,11211000AW0134,,,,,,,,,,,,,0,,,,,T,terres,,,385,2.204329,43.028958
2021-127990,2021-05-19,000001,Vente,175000,,,LE CAGNE,B008,11300,11211,Magrie,11,,,11211000AW0158,,,,,,,,,,,,,0,,,,,T,terres,,,23,2.204426,43.028946
2021-128008,2021-05-20,000001,Vente,160120,2,,LE PRAT,B043,11300,11211,Magrie,11,,,11211000AW0098,,,,,,,,,,,,,0,1,Maison,80,4,S,sols,,,608,2.202122,43.027254
2021-128407,2021-05-21,000001,Vente,25000,,,LE PRE LONG,B044,11300,11211,Magrie,11,,,11211000AC0082,,,,,,,,,,,,,0,,,,,BT,taillis simples,,,207,2.195861,43.027257
2021-128407,2021-05-21,000001,Vente,25000,,,LE PRE LONG,B044,11300,11211,Magrie,11,,,11211000AC0084,,,,,,,,,,,,,0,,,,,VI,vignes,,,4295,2.196137,43.026884
2021-128407,2021-05-21,000001,Vente,25000,,,LE PRE LONG,B044,11300,11211,Magrie,11,,,11211000AC0085,,,,,,,,,,,,,0,,,,,BT,taillis simples,,,28,2.195488,43.02623
2021-128661,2021-05-25,000001,Vente,47523,,,SAINT-MICHEL,B048,11300,11211,Magrie,11,,,11211000AY0014,,,,,,,,,,,,,0,,,,,VI,vignes,,,2881,2.210003,43.023377
2021-128661,2021-05-25,000001,Vente,47523,,,SAINT-MICHEL,B048,11300,11211,Magrie,11,,,11211000AY0015,,,,,,,,,,,,,0,,,,,BT,taillis simples,,,2261,2.209819,43.023414
2021-128661,2021-05-25,000001,Vente,47523,,,SAINT-MICHEL,B048,11300,11211,Magrie,11,,,11211000AY0016,,,,,,,,,,,,,0,,,,,BT,taillis simples,,,2623,2.210005,43.024106
2021-128661,2021-05-25,000001,Vente,47523,,,SAINT-MICHEL,B048,11300,11211,Magrie,11,,,11211000AY0017,,,,,,,,,,,,,0,,,,,VI,vignes,,,3352,2.210659,43.023799
2021-128661,2021-05-25,000001,Vente,47523,,,BRAU,B002,11300,11211,Magrie,11,,,11211000BD0001,,,,,,,,,,,,,0,,,,,L,landes,,,34051,2.220816,43.014089
2021-128661,2021-05-25,000001,Vente,47523,,,BRAU,B002,11300,11211,Magrie,11,,,11211000BD0031,,,,,,,,,,,,,0,,,,,L,landes,,,9297,2.221253,43.014651
2021-128661,2021-05-25,000001,Vente,47523,,,BRAU,B002,11300,11211,Magrie,11,,,11211000BK0005,,,,,,,,,,,,,0,,,,,VI,vignes,,,1411,2.210872,43.017109
2021-128661,2021-05-25,000001,Vente,47523,,,BRAU,B002,11300,11211,Magrie,11,,,11211000BK0008,,,,,,,,,,,,,0,,,,,VI,vignes,,,5313,2.210708,43.016631
2021-128661,2021-05-25,000001,Vente,47523,,,BRAU,B002,11300,11211,Magrie,11,,,11211000BK0009,,,,,,,,,,,,,0,,,,,T,terres,,,710,2.211529,43.016396
2021-128661,2021-05-25,000001,Vente,47523,,,BRAU,B002,11300,11211,Magrie,11,,,11211000BK0016,,,,,,,,,,,,,0,,,,,S,sols,,,199,2.211701,43.016081
2021-128661,2021-05-25,000001,Vente,47523,,,BRAU,B002,11300,11211,Magrie,11,,,11211000BK0016,,,,,,,,,,,,,0,,,,,VI,vignes,,,9811,2.211701,43.016081
2021-128661,2021-05-25,000001,Vente,47523,,,BRAU,B002,11300,11211,Magrie,11,,,11211000BK0017,,,,,,,,,,,,,0,,,,,VI,vignes,,,3796,2.211054,43.015365
2021-128661,2021-05-25,000001,Vente,47523,,,BRAU,B002,11300,11211,Magrie,11,,,11211000BK0018,,,,,,,,,,,,,0,,,,,L,landes,,,5765,2.211722,43.015145
2021-128661,2021-05-25,000001,Vente,47523,,,BRAU,B002,11300,11211,Magrie,11,,,11211000BK0019,,,,,,,,,,,,,0,,,,,VI,vignes,,,4671,2.211085,43.014823
2021-128661,2021-05-25,000001,Vente,47523,,,BRAU,B002,11300,11211,Magrie,11,,,11211000BK0021,,,,,,,,,,,,,0,,,,,VI,vignes,,,3720,2.210487,43.01554
2021-129204,2021-06-18,000001,Vente,5000,,,LE PURGATOIRE,B045,11300,11211,Magrie,11,,,11211000AI0014,,,,,,,,,,,,,0,,,,,VI,vignes,,,6867,2.199358,43.032316
2021-129741,2021-06-09,000001,Vente,121000,6,,AV DE MAUZAC,0022,11300,11211,Magrie,11,,,11211000AM0079,,,,,,,,,,,,,0,3,Dépendance,,0,S,sols,,,1071,2.206536,43.034158
2021-129741,2021-06-09,000001,Vente,121000,6,,AV DE MAUZAC,0022,11300,11211,Magrie,11,,,11211000AM0079,,,,,,,,,,,,,0,1,Maison,131,4,S,sols,,,1071,2.206536,43.034158
2021-129741,2021-06-09,000001,Vente,121000,6,,AV DE MAUZAC,0022,11300,11211,Magrie,11,,,11211000AM0079,,,,,,,,,,,,,0,3,Dépendance,,0,S,sols,,,1071,2.206536,43.034158
2021-129751,2021-06-25,000001,Vente,10000,6,,RUE DU CORDONNIER,0009,11300,11211,Magrie,11,,,11211000AA0140,,,,,,,,,,,,,0,,,,,S,sols,,,69,2.199833,43.027751
2021-130686,2021-07-08,000001,Vente,10000,4,,AV D'ALON,0001,11300,11211,Magrie,11,,,11211000AZ0091,,,,,,,,,,,,,0,,,,,S,sols,,,501,2.20129,43.027263
2021-130984,2021-07-21,000001,Vente,195000,6,,RTE DE LIMOUX,0046,11300,11211,Magrie,11,,,11211000AO0055,,,,,,,,,,,,,0,,,,,L,landes,,,486,2.215269,43.041137
2021-130984,2021-07-21,000001,Vente,195000,6,,RTE DE LIMOUX,0046,11300,11211,Magrie,11,,,11211000AO0057,,,,,,,,,,,,,0,1,Maison,97,5,T,terres,,,574,2.215457,43.040853
2021-130984,2021-07-21,000001,Vente,195000,6,,RTE DE LIMOUX,0046,11300,11211,Magrie,11,,,11211000AO0057,,,,,,,,,,,,,0,1,Maison,97,5,S,sols,,,1000,2.215457,43.040853
2021-130984,2021-07-21,000001,Vente,195000,,,MONTREALAT,B034,11300,11211,Magrie,11,,,11211000AO0058,,,,,,,,,,,,,0,,,,,T,terres,,,612,2.21622,43.041517
2021-131272,2021-08-04,000001,Vente,208420,3,,CHE DU MOULIN,0024,11300,11211,Magrie,11,,,11211000AZ0085,,,,,,,,,,,,,0,1,Maison,75,2,S,sols,,,562,2.200009,43.026693
2021-134136,2021-10-06,000001,Vente,700,,,LE CAGNE,B008,11300,11211,Magrie,11,,,11211000AW0034,,,,,,,,,,,,,0,,,,,S,sols,,,85,2.202093,43.028004
2021-134378,2021-10-13,000001,Vente,25000,,,LES GRAVES,B027,11300,11211,Magrie,11,,,11211000BL0066,,,,,,,,,,,,,0,,,,,S,sols,,,236,2.207743,43.018706
2021-134378,2021-10-13,000001,Vente,25000,,,LES GRAVES,B027,11300,11211,Magrie,11,,,11211000BL0066,,,,,,,,,,,,,0,,,,,VE,vergers,,,2724,2.207743,43.018706
2021-134378,2021-10-13,000001,Vente,25000,,,LES GRAVES,B027,11300,11211,Magrie,11,,,11211000BL0066,,,,,,,,,,,,,0,,,,,T,terres,,,2154,2.207743,43.018706
2021-135470,2021-10-21,000001,Vente,200,,,FOUNT AULY,B018,11300,11211,Magrie,11,,,11211000BR0037,,,,,,,,,,,,,0,,,,,L,landes,,,339,2.188246,43.017982
2021-135505,2021-10-21,000001,Vente,600,,,PENNER,B037,11300,11211,Magrie,11,,,11211000AL0021,,,,,,,,,,,,,0,,,,,BT,taillis simples,,,5951,2.183408,43.032654
2021-135505,2021-10-21,000001,Vente,600,,,GANIBERT,B024,11300,11211,Magrie,11,,,11211000AL0106,,,,,,,,,,,,,0,,,,,L,landes,,,6948,2.193522,43.032146
2021-135505,2021-10-21,000001,Vente,600,,,LE DEBES,B017,11300,11211,Magrie,11,,,11211000BO0057,,,,,,,,,,,,,0,,,,,L,landes,,,2607,2.189809,43.014931
2021-135507,2021-10-21,000001,Vente,400,,,PENNER,B037,11300,11211,Magrie,11,,,11211000AL0022,,,,,,,,,,,,,0,,,,,L,landes,,,8887,2.183736,43.031453
2021-136169,2021-11-17,000001,Vente,6000,,,LAS COSTOS,B030,11300,11211,Magrie,11,,,11211000BL0047,,,,,,,,,,,,,0,,,,,VE,vergers,,,1889,2.208275,43.021399
2021-136169,2021-11-17,000001,Vente,6000,,,LAS COSTOS,B030,11300,11211,Magrie,11,,,11211000BL0048,,,,,,,,,,,,,0,,,,,S,sols,,,100,2.208475,43.021304
2021-136169,2021-11-17,000001,Vente,6000,,,LAS COSTOS,B030,11300,11211,Magrie,11,,,11211000BL0048,,,,,,,,,,,,,0,,,,,J,jardins,POTAG,Jardin potager,1206,2.208475,43.021304
2021-136475,2021-12-01,000001,Vente,59520,3,,RUE D'OCCITANIE,0025,11300,11211,Magrie,11,,,11211000AA0127,,,,,,,,,,,,,0,1,Maison,60,4,S,sols,,,58,2.200486,43.027909
2021-136475,2021-12-01,000001,Vente,59520,,,RUE D'OCCITANIE,0025,11300,11211,Magrie,11,,,11211000AA0212,,,,,,,,,,,,,0,,,,,S,sols,,,60,2.200475,43.027865
2021-136759,2021-12-09,000001,Vente,1,8,,AV D'ALON,0001,11300,11211,Magrie,11,,,11211000AZ0259,,,,,,,,,,,,,0,,,,,S,sols,,,56,2.200132,43.026764
2021-136789,2021-08-12,000001,Vente,218000,5000,,AV DU JUEL,0017,11300,11211,Magrie,11,,,11211000AW0137,,,,,,,,,,,,,0,3,Dépendance,,0,S,sols,,,518,2.204086,43.029238
2021-136789,2021-08-12,000001,Vente,218000,5000,,AV DU JUEL,0017,11300,11211,Magrie,11,,,11211000AW0137,,,,,,,,,,,,,0,1,Maison,93,3,S,sols,,,518,2.204086,43.029238
2021-136789,2021-08-12,000001,Vente,218000,,,LE CAGNE,B008,11300,11211,Magrie,11,,,11211000AW0138,,,,,,,,,,,,,0,,,,,S,sols,,,349,2.204303,43.029292
2021-136789,2021-08-12,000001,Vente,218000,,,LE CAGNE,B008,11300,11211,Magrie,11,,,11211000AW0156,,,,,,,,,,,,,0,,,,,T,terres,,,22,2.204372,43.029316
2021-137124,2021-12-10,000001,Vente,10000,16,,RUE DU CORDONNIER,0009,11300,11211,Magrie,11,,,11211000AA0166,,,,,,,,,,,,,0,,,,,S,sols,,,106,2.199166,43.027546
