id_mutation,date_mutation,numero_disposition,nature_mutation,valeur_fonciere,adresse_numero,adresse_suffixe,adresse_nom_voie,adresse_code_voie,code_postal,code_commune,nom_commune,code_departement,ancien_code_commune,ancien_nom_commune,id_parcelle,ancien_id_parcelle,numero_volume,lot1_numero,lot1_surface_carrez,lot2_numero,lot2_surface_carrez,lot3_numero,lot3_surface_carrez,lot4_numero,lot4_surface_carrez,lot5_numero,lot5_surface_carrez,nombre_lots,code_type_local,type_local,surface_reelle_bati,nombre_pieces_principales,code_nature_culture,nature_culture,code_nature_culture_speciale,nature_culture_speciale,surface_terrain,longitude,latitude
2021-125739,2021-01-20,000001,Vente,18000,149,,LE VILLAGE,B025,11700,11337,Saint-Couat-d'Aude,11,,,113370000D0690,,,,,,,,,,,,,0,1,Maison,61,1,S,sols,,,85,2.629788,43.202506
2021-126105,2021-02-01,000001,Vente,34000,138,,LE VILLAGE,B025,11700,11337,Saint-Couat-d'Aude,11,,,113370000D0312,,,,,,,,,,,,,0,1,Maison,46,2,S,sols,,,17,2.630073,43.202653
2021-126106,2021-02-01,000001,Vente,3000,,,LE VILLAGE,B025,11700,11337,Saint-Couat-d'Aude,11,,,113370000D0394,,,,,,,,,,,,,0,,,,,S,sols,,,16,2.630042,43.202652
2021-127054,2021-03-23,000001,Vente,223000,15,B,AV DU MONT ALARIC,0098,11700,11337,Saint-Couat-d'Aude,11,,,113370000D0704,,,,,,,,,,,,,0,1,Maison,100,3,S,sols,,,332,2.63029,43.201746
2021-127054,2021-03-23,000001,Vente,223000,,,LE VILLAGE,B025,11700,11337,Saint-Couat-d'Aude,11,,,113370000D0723,,,,,,,,,,,,,0,,,,,S,sols,,,115,2.630246,43.201653
2021-127069,2021-03-31,000001,Vente,170000,5,,CHE DE CANELLE,0024,11700,11337,Saint-Couat-d'Aude,11,,,113370000B0325,,,,,,,,,,,,,0,1,Maison,161,6,L,landes,,,3000,2.640902,43.201995
2021-127069,2021-03-31,000001,Vente,170000,5,,CHE DE CANELLE,0024,11700,11337,Saint-Couat-d'Aude,11,,,113370000B0325,,,,,,,,,,,,,0,1,Maison,161,6,S,sols,,,1000,2.640902,43.201995
2021-127069,2021-03-31,000001,Vente,170000,5,,CHE DE CANELLE,0024,11700,11337,Saint-Couat-d'Aude,11,,,113370000B0325,,,,,,,,,,,,,0,3,Dépendance,,0,S,sols,,,1000,2.640902,43.201995
2021-127069,2021-03-31,000001,Vente,170000,5,,CHE DE CANELLE,0024,11700,11337,Saint-Couat-d'Aude,11,,,113370000B0325,,,,,,,,,,,,,0,3,Dépendance,,0,L,landes,,,3000,2.640902,43.201995
2021-127100,2021-03-23,000001,Vente,2500,,,LES RIVIERES,B022,11700,11337,Saint-Couat-d'Aude,11,,,113370000D0089,,,,,,,,,,,,,0,,,,,T,terres,,,3915,2.622949,43.213431
2021-127123,2021-04-07,000001,Vente,40000,,,CHEMIN DE DOUZENS,B007,11700,11337,Saint-Couat-d'Aude,11,,,113370000D0021,,,,,,,,,,,,,0,,,,,T,terres,,,1188,2.62974,43.199007
2021-127123,2021-04-07,000001,Vente,40000,,,CHEMIN DE DOUZENS,B007,11700,11337,Saint-Couat-d'Aude,11,,,113370000D0022,,,,,,,,,,,,,0,,,,,T,terres,,,5048,2.630109,43.198692
2021-127123,2021-04-07,000001,Vente,40000,,,CHEMIN DE DOUZENS,B007,11700,11337,Saint-Couat-d'Aude,11,,,113370000D0023,,,,,,,,,,,,,0,,,,,T,terres,,,5616,2.630321,43.198232
2021-127123,2021-04-07,000001,Vente,40000,,,CHEMIN DE DOUZENS,B007,11700,11337,Saint-Couat-d'Aude,11,,,113370000D0024,,,,,,,,,,,,,0,,,,,T,terres,,,10215,2.630244,43.197721
2021-127317,2021-04-14,000001,Vente,75000,149,,LE VILLAGE,B025,11700,11337,Saint-Couat-d'Aude,11,,,113370000D0691,,,,,,,,,,,,,0,1,Maison,140,6,S,sols,,,205,2.629691,43.202542
2021-128770,2021-06-10,000001,Vente,14000,,,LA PLAINE,B017,11700,11337,Saint-Couat-d'Aude,11,,,113370000C0009,,,,,,,,,,,,,0,,,,,T,terres,,,3447,2.634501,43.220234
2021-128770,2021-06-10,000001,Vente,14000,,,LA PLAINE,B017,11700,11337,Saint-Couat-d'Aude,11,,,113370000C0036,,,,,,,,,,,,,0,,,,,T,terres,,,13557,2.629716,43.219886
2021-128770,2021-06-10,000001,Vente,14000,,,DERRIERE LE PLO,B011,11700,11337,Saint-Couat-d'Aude,11,,,113370000C0062,,,,,,,,,,,,,0,,,,,T,terres,,,8419,2.63389,43.219585
2021-129599,2021-06-22,000001,Vente,141191,,,FLEICH,B012,11700,11337,Saint-Couat-d'Aude,11,,,113370000B0154,,,,,,,,,,,,,0,,,,,VI,vignes,,,3612,2.64155,43.205572
2021-129599,2021-06-22,000001,Vente,141191,,,FLEICH,B012,11700,11337,Saint-Couat-d'Aude,11,,,113370000B0154,,,,,,,,,,,,,0,,,,,VI,vignes,,,3915,2.64155,43.205572
2021-129599,2021-06-22,000001,Vente,141191,,,FLEICH,B012,11700,11337,Saint-Couat-d'Aude,11,,,113370000B0154,,,,,,,,,,,,,0,,,,,T,terres,,,2757,2.64155,43.205572
2021-129599,2021-06-22,000001,Vente,141191,,,FLEICH,B012,11700,11337,Saint-Couat-d'Aude,11,,,113370000B0210,,,,,,,,,,,,,0,,,,,VI,vignes,,,1660,2.640488,43.205985
2021-129599,2021-06-22,000001,Vente,141191,,,FLEICH,B012,11700,11337,Saint-Couat-d'Aude,11,,,113370000B0210,,,,,,,,,,,,,0,,,,,T,terres,,,1530,2.640488,43.205985
2021-132210,2021-08-09,000001,Vente,48000,5179,,LE VILLAGE,B025,11700,11337,Saint-Couat-d'Aude,11,,,113370000D0317,,,,,,,,,,,,,0,1,Maison,42,2,S,sols,,,28,2.63039,43.202555
2021-132708,2021-09-07,000001,Vente,2500,,,LA PLAINE,B017,11700,11337,Saint-Couat-d'Aude,11,,,113370000C0014,,,,,,,,,,,,,0,,,,,T,terres,,,3490,2.632694,43.220595
2021-132708,2021-09-07,000001,Vente,2500,,,LA PLAINE,B017,11700,11337,Saint-Couat-d'Aude,11,,,113370000C0252,,,,,,,,,,,,,0,,,,,S,sols,,,360,2.633171,43.220565
2021-133049,2021-09-06,000001,Vente,178400,,,IMP DU CHATEAU,0039,11700,11337,Saint-Couat-d'Aude,11,,,113370000D0313,,,,,,,,,,,,,0,3,Dépendance,,0,S,sols,,,33,2.630128,43.20263
2021-133049,2021-09-06,000001,Vente,178400,,,LE VILLAGE,B025,11700,11337,Saint-Couat-d'Aude,11,,,113370000D0637,,,,,,,,,,,,,0,,,,,S,sols,,,46,2.630256,43.202489
2021-133049,2021-09-06,000001,Vente,178400,4,,IMP DU CHATEAU,0039,11700,11337,Saint-Couat-d'Aude,11,,,113370000D0724,,,,,,,,,,,,,0,1,Maison,140,5,S,sols,,,67,2.630186,43.202515
2021-134076,2021-09-29,000001,Vente,131240,13,,CHEMIN DE PUICHERIC,B008,11700,11337,Saint-Couat-d'Aude,11,,,113370000D0539,,,,,,,,,,,,,0,1,Maison,64,3,S,sols,,,550,2.631474,43.203675
2021-134250,2021-09-21,000001,Vente,45000,9,,GR GRAND RUE,0074,11700,11337,Saint-Couat-d'Aude,11,,,113370000D0301,,,,,,,,,,,,,0,1,Maison,60,4,S,sols,,,68,2.629757,43.203054
2021-135012,2021-10-21,000001,Vente,114000,36,,LE VILLAGE,B025,11700,11337,Saint-Couat-d'Aude,11,,,113370000D0432,,,,,,,,,,,,,0,1,Maison,112,6,S,sols,,,113,2.631938,43.201641
2021-135073,2021-10-14,000001,Vente,30000,122,,LE VILLAGE,B025,11700,11337,Saint-Couat-d'Aude,11,,,113370000D0297,,,,,,,,,,,,,0,1,Maison,62,1,S,sols,,,38,2.629937,43.202955
2021-137647,2021-12-23,000001,Echange,7000,,,LE PEYRA,B016,11700,11337,Saint-Couat-d'Aude,11,,,113370000B0038,,,,,,,,,,,,,0,,,,,T,terres,,,4204,2.641346,43.209917
2021-137647,2021-12-23,000001,Echange,7000,,,LE VIGNIER,B024,11700,11337,Saint-Couat-d'Aude,11,,,113370000C0217,,,,,,,,,,,,,0,,,,,VI,vignes,,,7443,2.632173,43.209907
2021-137809,2021-12-28,000001,Vente,160.55,,,LA CROSE,B010,11700,11337,Saint-Couat-d'Aude,11,,,113370000C0149,,,,,,,,,,,,,0,,,,,VI,vignes,,,3211,2.640923,43.212043
