id_mutation,date_mutation,numero_disposition,nature_mutation,valeur_fonciere,adresse_numero,adresse_suffixe,adresse_nom_voie,adresse_code_voie,code_postal,code_commune,nom_commune,code_departement,ancien_code_commune,ancien_nom_commune,id_parcelle,ancien_id_parcelle,numero_volume,lot1_numero,lot1_surface_carrez,lot2_numero,lot2_surface_carrez,lot3_numero,lot3_surface_carrez,lot4_numero,lot4_surface_carrez,lot5_numero,lot5_surface_carrez,nombre_lots,code_type_local,type_local,surface_reelle_bati,nombre_pieces_principales,code_nature_culture,nature_culture,code_nature_culture_speciale,nature_culture_speciale,surface_terrain,longitude,latitude
2021-128302,2021-05-11,000001,Vente,7091,,,MONT AURIOL,B035,11360,11431,Villeneuve-les-Corbières,11,,,114310000C0496,,,,,,,,,,,,,0,,,,,VI,vignes,,,10130,2.763611,42.958798
2021-131054,2021-07-16,000001,Vente,179100,13,,AV DU  PONT  NEUF,0068,11360,11431,Villeneuve-les-Corbières,11,,,114310000A0958,,,,,,,,,,,,,0,1,Maison,103,3,S,sols,,,799,2.774126,42.978792
2021-131054,2021-07-16,000001,Vente,179100,13,,AV DU  PONT  NEUF,0068,11360,11431,Villeneuve-les-Corbières,11,,,114310000A0958,,,,,,,,,,,,,0,3,Dépendance,,0,S,sols,,,799,2.774126,42.978792
2021-131099,2021-07-07,000001,Vente,8000,1,,CHE DES VIGNES ROUGES,0114,11360,11431,Villeneuve-les-Corbières,11,,,114310000C0702,,,,,,,,,,,,,0,,,,,T,terres,,,1020,2.772798,42.97512
2021-131238,2021-07-29,000001,Vente,100,,,LES ABRIGANS,B001,11360,11431,Villeneuve-les-Corbières,11,,,114310000B0499,,,,,,,,,,,,,0,,,,,VI,vignes,,,5000,2.778872,42.972888
2021-131238,2021-07-29,000001,Vente,100,,,LES ABRIGANS,B001,11360,11431,Villeneuve-les-Corbières,11,,,114310000B0499,,,,,,,,,,,,,0,,,,,T,terres,,,550,2.778872,42.972888
2021-131260,2021-07-29,000001,Vente,10000,,,LES ARDOISES,B002,11360,11431,Villeneuve-les-Corbières,11,,,114310000C0545,,,,,,,,,,,,,0,,,,,VI,vignes,,,2990,2.757166,42.950355
2021-131260,2021-07-29,000001,Vente,10000,,,LES ARDOISES,B002,11360,11431,Villeneuve-les-Corbières,11,,,114310000C0575,,,,,,,,,,,,,0,,,,,VI,vignes,,,1030,2.756241,42.950144
2021-131260,2021-07-29,000001,Vente,10000,,,LES ARDOISES,B002,11360,11431,Villeneuve-les-Corbières,11,,,114310000C1174,,,,,,,,,,,,,0,,,,,L,landes,,,5980,2.756485,42.950346
2021-131260,2021-07-29,000001,Vente,10000,,,LES ARDOISES,B002,11360,11431,Villeneuve-les-Corbières,11,,,114310000C1174,,,,,,,,,,,,,0,,,,,VI,vignes,,,3000,2.756485,42.950346
2021-132957,2021-09-08,000001,Vente,205512,4,,RUE PILOTE,0066,11360,11431,Villeneuve-les-Corbières,11,,,114310000C1020,,,,,,,,,,,,,0,1,Maison,95,4,S,sols,,,720,2.774208,42.976433
2021-133090,2021-08-13,000001,Vente,70000,,,MONTLUZIS,B039,11360,11431,Villeneuve-les-Corbières,11,,,114310000C0295,,,,,,,,,,,,,0,,,,,L,landes,,,7620,2.749926,42.953194
2021-133090,2021-08-13,000001,Vente,70000,,,MONTLUZIS,B039,11360,11431,Villeneuve-les-Corbières,11,,,114310000C0296,,,,,,,,,,,,,0,,,,,VI,vignes,,,2500,2.750448,42.954007
2021-133090,2021-08-13,000001,Vente,70000,,,LES ARDOISES,B002,11360,11431,Villeneuve-les-Corbières,11,,,114310000C0553,,,,,,,,,,,,,0,,,,,VI,vignes,,,1800,2.754535,42.952403
2021-133090,2021-08-13,000001,Vente,70000,,,LES ARDOISES,B002,11360,11431,Villeneuve-les-Corbières,11,,,114310000C0553,,,,,,,,,,,,,0,,,,,L,landes,,,1120,2.754535,42.952403
2021-133090,2021-08-13,000001,Vente,70000,,,LES ARDOISES,B002,11360,11431,Villeneuve-les-Corbières,11,,,114310000C0554,,,,,,,,,,,,,0,,,,,L,landes,,,2480,2.754545,42.953177
2021-133090,2021-08-13,000001,Vente,70000,,,LES ARDOISES,B002,11360,11431,Villeneuve-les-Corbières,11,,,114310000C0554,,,,,,,,,,,,,0,,,,,VI,vignes,,,5200,2.754545,42.953177
2021-133090,2021-08-13,000001,Vente,70000,,,LES ARDOISES,B002,11360,11431,Villeneuve-les-Corbières,11,,,114310000C0555,,,,,,,,,,,,,0,,,,,VI,vignes,,,9630,2.753619,42.954071
2021-133090,2021-08-13,000001,Vente,70000,,,LES ARDOISES,B002,11360,11431,Villeneuve-les-Corbières,11,,,114310000C0558,,,,,,,,,,,,,0,,,,,VI,vignes,,,8445,2.750846,42.952157
2021-133090,2021-08-13,000001,Vente,70000,,,LES ARDOISES,B002,11360,11431,Villeneuve-les-Corbières,11,,,114310000C0559,,,,,,,,,,,,,0,,,,,VI,vignes,,,1340,2.75031,42.95268
2021-133090,2021-08-13,000001,Vente,70000,,,LES ARDOISES,B002,11360,11431,Villeneuve-les-Corbières,11,,,114310000C0560,,,,,,,,,,,,,0,,,,,VI,vignes,,,6690,2.750197,42.952059
2021-133090,2021-08-13,000001,Vente,70000,,,LES ARDOISES,B002,11360,11431,Villeneuve-les-Corbières,11,,,114310000C0563,,,,,,,,,,,,,0,,,,,VI,vignes,,,20620,2.751982,42.952012
2021-133090,2021-08-13,000001,Vente,70000,,,LES ARDOISES,B002,11360,11431,Villeneuve-les-Corbières,11,,,114310000C0564,,,,,,,,,,,,,0,,,,,VI,vignes,,,10370,2.753776,42.951794
2021-133090,2021-08-13,000001,Vente,70000,,,MONTLUZIS,B039,11360,11431,Villeneuve-les-Corbières,11,,,114310000C1150,,,,,,,,,,,,,0,,,,,L,landes,,,18125,2.749982,42.953235
2021-133090,2021-08-13,000001,Vente,70000,,,LES ARDOISES,B002,11360,11431,Villeneuve-les-Corbières,11,,,114310000C1154,,,,,,,,,,,,,0,,,,,L,landes,,,1505,2.751034,42.951904
2021-133090,2021-08-13,000001,Vente,70000,,,LES ARDOISES,B002,11360,11431,Villeneuve-les-Corbières,11,,,114310000C1156,,,,,,,,,,,,,0,,,,,L,landes,,,20000,2.751768,42.95309
2021-133090,2021-08-13,000001,Vente,70000,,,MONTLUZIS,B039,11360,11431,Villeneuve-les-Corbières,11,,,114310000C1158,,,,,,,,,,,,,0,,,,,L,landes,,,2531,2.74932,42.952525
2021-133090,2021-08-13,000001,Vente,70000,,,LES ARDOISES,B002,11360,11431,Villeneuve-les-Corbières,11,,,114310000C1176,,,,,,,,,,,,,0,,,,,VI,vignes,,,13370,2.753746,42.952632
2021-133090,2021-08-13,000001,Vente,70000,,,LES ARDOISES,B002,11360,11431,Villeneuve-les-Corbières,11,,,114310000C1176,,,,,,,,,,,,,0,,,,,L,landes,,,3530,2.753746,42.952632
2021-134834,2021-09-27,000001,Vente,96210,11,,RUE DES MOULINS,0059,11360,11431,Villeneuve-les-Corbières,11,,,114310000A0823,,,,,,,,,,,,,0,1,Maison,126,4,S,sols,,,166,2.775039,42.977499
2021-136448,2021-11-16,000001,Vente,8000,1,,CHE DES VIGNES ROUGES,0114,11360,11431,Villeneuve-les-Corbières,11,,,114310000C0702,,,,,,,,,,,,,0,,,,,T,terres,,,1020,2.772798,42.97512
2021-137603,2021-12-07,000001,Vente,107000,25,,AV DES  HAUTES  CORBIERES,0043,11360,11431,Villeneuve-les-Corbières,11,,,114310000A0237,,,,,,,,,,,,,0,1,Maison,100,4,S,sols,,,110,2.776251,42.976759
2021-138022,2021-12-30,000001,Vente,1000,,,LAS CANELLOTOS,B033,11360,11431,Villeneuve-les-Corbières,11,,,114310000A0469,,,,,,,,,,,,,0,,,,,VI,vignes,,,2440,2.772524,42.980892
2021-138586,2021-09-08,000001,Vente,205000,6,,AV DU PONT NEUF,0068,11360,11431,Villeneuve-les-Corbières,11,,,114310000A0965,,,,,,,,,,,,,0,1,Maison,120,4,S,sols,,,730,2.776168,42.978449
2021-138586,2021-09-08,000001,Vente,205000,6,,AV DU PONT NEUF,0068,11360,11431,Villeneuve-les-Corbières,11,,,114310000A0965,,,,,,,,,,,,,0,1,Maison,120,4,AG,terrains d'agrément,PARC,Parc,2000,2.776168,42.978449
2021-138914,2021-01-29,000001,Vente,103000,25,,AV DES  HAUTES  CORBIERES,0043,11360,11431,Villeneuve-les-Corbières,11,,,114310000A0237,,,,,,,,,,,,,0,1,Maison,100,4,S,sols,,,110,2.776251,42.976759
2021-139544,2021-03-02,000001,Vente,19000,,,A BERA,B007,11360,11431,Villeneuve-les-Corbières,11,,,114310000A0439,,,,,,,,,,,,,0,,,,,VI,vignes,,,6370,2.775404,42.984127
2021-139544,2021-03-02,000001,Vente,19000,,,COL DE L ESPIGNE,B016,11360,11431,Villeneuve-les-Corbières,11,,,114310000B0763,,,,,,,,,,,,,0,,,,,VI,vignes,,,6538,2.788746,42.961396
2021-139544,2021-03-02,000001,Vente,19000,,,LES COURTALS,B022,11360,11431,Villeneuve-les-Corbières,11,,,114310000B1077,,,,,,,,,,,,,0,,,,,T,terres,,,3500,2.767135,42.960364
2021-139544,2021-03-02,000001,Vente,19000,,,LES COURTALS,B022,11360,11431,Villeneuve-les-Corbières,11,,,114310000B1129,,,,,,,,,,,,,0,,,,,T,terres,,,4210,2.767968,42.960123
2021-139544,2021-03-02,000001,Vente,19000,,,COSTO SOULANO,B020,11360,11431,Villeneuve-les-Corbières,11,,,114310000C0416,,,,,,,,,,,,,0,,,,,VI,vignes,,,11630,2.761848,42.961621
2021-139544,2021-03-02,000001,Vente,19000,,,COSTO SOULANO,B020,11360,11431,Villeneuve-les-Corbières,11,,,114310000C0417,,,,,,,,,,,,,0,,,,,T,terres,,,4650,2.760808,42.962133
2021-139544,2021-03-02,000001,Vente,19000,,,COSTO SOULANO,B020,11360,11431,Villeneuve-les-Corbières,11,,,114310000C0418,,,,,,,,,,,,,0,,,,,VI,vignes,,,4260,2.761362,42.962643
2021-139544,2021-03-02,000001,Vente,19000,,,COSTO SOULANO,B020,11360,11431,Villeneuve-les-Corbières,11,,,114310000C0445,,,,,,,,,,,,,0,,,,,VI,vignes,,,4830,2.763783,42.964097
2021-139544,2021-03-02,000001,Vente,19000,,,COSTO SOULANO,B020,11360,11431,Villeneuve-les-Corbières,11,,,114310000C0446,,,,,,,,,,,,,0,,,,,VI,vignes,,,7755,2.764769,42.963614
2021-139544,2021-03-02,000001,Vente,19000,,,COSTO SOULANO,B020,11360,11431,Villeneuve-les-Corbières,11,,,114310000C0450,,,,,,,,,,,,,0,,,,,T,terres,,,5600,2.766104,42.965433
2021-139573,2021-02-15,000001,Vente,157000,6,,AV DES  HAUTES  CORBIERES,0043,11360,11431,Villeneuve-les-Corbières,11,,,114310000A0881,,,,,,,,,,,,,0,1,Maison,140,5,S,sols,,,746,2.779449,42.977872
2021-139808,2021-03-01,000001,Vente,30650,18,,RUE DE  LA  REVOLUTION,0076,11360,11431,Villeneuve-les-Corbières,11,,,114310000A0015,,,,,,,,,,,,,0,1,Maison,74,5,S,sols,,,24,2.774525,42.977937
2021-139808,2021-03-01,000001,Vente,30650,18,,RUE DE  LA  REVOLUTION,0076,11360,11431,Villeneuve-les-Corbières,11,,,114310000A0016,,,,,,,,,,,,,0,,,,,S,sols,,,24,2.774527,42.977906
