id_mutation,date_mutation,numero_disposition,nature_mutation,valeur_fonciere,adresse_numero,adresse_suffixe,adresse_nom_voie,adresse_code_voie,code_postal,code_commune,nom_commune,code_departement,ancien_code_commune,ancien_nom_commune,id_parcelle,ancien_id_parcelle,numero_volume,lot1_numero,lot1_surface_carrez,lot2_numero,lot2_surface_carrez,lot3_numero,lot3_surface_carrez,lot4_numero,lot4_surface_carrez,lot5_numero,lot5_surface_carrez,nombre_lots,code_type_local,type_local,surface_reelle_bati,nombre_pieces_principales,code_nature_culture,nature_culture,code_nature_culture_speciale,nature_culture_speciale,surface_terrain,longitude,latitude
2021-141836,2021-01-28,000001,Vente,19706,,,LOT LE CAYROL 2,A011,12500,12064,Le Cayrol,12,,,120640000B1250,,,,,,,,,,,,,0,,,,,L,landes,PATUR,Pâture plantée,714,2.790432,44.584411
2021-144279,2021-05-27,000001,Vente,299000,,,LE THAILLAU,B179,12500,12064,Le Cayrol,12,,,120640000A0045,,,,,,,,,,,,,0,,,,,L,landes,PATUR,Pâture plantée,13070,2.803319,44.59601
2021-144279,2021-05-27,000001,Vente,299000,,,LE THAILLAU,B179,12500,12064,Le Cayrol,12,,,120640000A0046,,,,,,,,,,,,,0,,,,,L,landes,PATUR,Pâture plantée,700,2.803635,44.596534
2021-144279,2021-05-27,000001,Vente,299000,,,LE THAILLAU,B179,12500,12064,Le Cayrol,12,,,120640000A0047,,,,,,,,,,,,,0,,,,,S,sols,,,603,2.803761,44.596531
2021-144279,2021-05-27,000001,Vente,299000,,,LE THAILLAU,B179,12500,12064,Le Cayrol,12,,,120640000A0048,,,,,,,,,,,,,0,,,,,L,landes,PATUR,Pâture plantée,28955,2.80469,44.595693
2021-144279,2021-05-27,000001,Vente,299000,,,LE THAILLAU,B179,12500,12064,Le Cayrol,12,,,120640000A0048,,,,,,,,,,,,,0,,,,,L,landes,PATUR,Pâture plantée,28955,2.80469,44.595693
2021-144279,2021-05-27,000001,Vente,299000,,,LE THAILLAU,B179,12500,12064,Le Cayrol,12,,,120640000A0049,,,,,,,,,,,,,0,,,,,L,landes,PATUR,Pâture plantée,13420,2.803374,44.594863
2021-144279,2021-05-27,000001,Vente,299000,,,LE THAILLAU,B179,12500,12064,Le Cayrol,12,,,120640000A0050,,,,,,,,,,,,,0,,,,,VE,vergers,CHAT,Châtaigneraie,3120,2.803481,44.594248
2021-144279,2021-05-27,000001,Vente,299000,,,LE THAILLAU,B179,12500,12064,Le Cayrol,12,,,120640000A0051,,,,,,,,,,,,,0,,,,,L,landes,VAGUE,Terrain vague,4560,2.804516,44.593607
2021-144279,2021-05-27,000001,Vente,299000,,,LA VERGNE,B187,12500,12064,Le Cayrol,12,,,120640000A0052,,,,,,,,,,,,,0,,,,,BT,taillis simples,,,3080,2.80434,44.593203
2021-144279,2021-05-27,000001,Vente,299000,,,LA VERGNE,B187,12500,12064,Le Cayrol,12,,,120640000A0060,,,,,,,,,,,,,0,,,,,BT,taillis simples,,,10810,2.807336,44.594988
2021-144279,2021-05-27,000001,Vente,299000,,,LA COMBETTE,B055,12500,12064,Le Cayrol,12,,,120640000A0479,,,,,,,,,,,,,0,,,,,BT,taillis simples,,,6880,2.808593,44.59504
2021-144279,2021-05-27,000001,Vente,299000,,,LA GALINE,B084,12500,12064,Le Cayrol,12,,,120640000A0592,,,,,,,,,,,,,0,,,,,T,terres,,,5356,2.803126,44.594335
2021-144279,2021-05-27,000001,Vente,299000,,,BOIS D ESCANIES,B017,12500,12064,Le Cayrol,12,,,12064000AC0094,,,,,,,,,,,,,0,,,,,BR,futaies résineuses,,,4370,2.753302,44.583736
2021-144279,2021-05-27,000001,Vente,299000,,,BOIS D ESCANIES,B017,12500,12064,Le Cayrol,12,,,12064000AC0095,,,,,,,,,,,,,0,,,,,BR,futaies résineuses,,,105990,2.756123,44.583571
2021-144279,2021-05-27,000001,Vente,299000,,,BOIS D ESCANIES,B017,12500,12064,Le Cayrol,12,,,12064000AC0116,,,,,,,,,,,,,0,,,,,BR,futaies résineuses,,,4645,2.751703,44.583287
2021-144279,2021-05-27,000001,Vente,299000,,,BOIS D ESCANIES,B017,12500,12064,Le Cayrol,12,,,12064000AC0117,,,,,,,,,,,,,0,,,,,BR,futaies résineuses,,,3500,2.750285,44.582662
2021-145466,2021-06-10,000001,Vente,491,,,BOIS DE BONNEVAL,B018,12500,12064,Le Cayrol,12,,,120640000A0325,,,,,,,,,,,,,0,,,,,BS,taillis sous futaie,,,4910,2.788142,44.560502
2021-146411,2021-08-09,000001,Echange,4000,,,COMPENS,B057,12500,12064,Le Cayrol,12,,,120640000B0576,,,,,,,,,,,,,0,,,,,T,terres,,,7690,2.777056,44.559239
2021-147745,2021-09-28,000001,Vente,203000,,,COUSSANES,B063,12500,12064,Le Cayrol,12,,,120640000B0202,,,,,,,,,,,,,0,,,,,S,sols,,,56,2.793268,44.5778
2021-147745,2021-09-28,000001,Vente,203000,5142,,COUSSANES,B063,12500,12064,Le Cayrol,12,,,120640000B0203,,,,,,,,,,,,,0,1,Maison,50,1,S,sols,,,202,2.793206,44.577703
2021-147745,2021-09-28,000001,Vente,203000,,,COUSSANES,B063,12500,12064,Le Cayrol,12,,,120640000B0211,,,,,,,,,,,,,0,,,,,T,terres,,,276,2.793061,44.577633
2021-147745,2021-09-28,000001,Vente,203000,5020,,COUSSANES,B063,12500,12064,Le Cayrol,12,,,120640000B0212,,,,,,,,,,,,,0,1,Maison,82,3,S,sols,,,440,2.792908,44.577545
