id_mutation,date_mutation,numero_disposition,nature_mutation,valeur_fonciere,adresse_numero,adresse_suffixe,adresse_nom_voie,adresse_code_voie,code_postal,code_commune,nom_commune,code_departement,ancien_code_commune,ancien_nom_commune,id_parcelle,ancien_id_parcelle,numero_volume,lot1_numero,lot1_surface_carrez,lot2_numero,lot2_surface_carrez,lot3_numero,lot3_surface_carrez,lot4_numero,lot4_surface_carrez,lot5_numero,lot5_surface_carrez,nombre_lots,code_type_local,type_local,surface_reelle_bati,nombre_pieces_principales,code_nature_culture,nature_culture,code_nature_culture_speciale,nature_culture_speciale,surface_terrain,longitude,latitude
2021-141565,2021-01-22,000001,Vente,210000,,,LA CARRADIE,B022,12170,12092,Durenque,12,,,120920000E0171,,,,,,,,,,,,,0,,,,,T,terres,,,13200,2.589528,44.097454
2021-141565,2021-01-22,000001,Vente,210000,,,LES PLACES,B066,12170,12092,Durenque,12,,,120920000E0183,,,,,,,,,,,,,0,,,,,T,terres,,,42337,2.584787,44.089828
2021-141565,2021-01-22,000001,Vente,210000,,,LES PLACES,B066,12170,12092,Durenque,12,,,120920000E0183,,,,,,,,,,,,,0,,,,,T,terres,,,42336,2.584787,44.089828
2021-141565,2021-01-22,000001,Vente,210000,,,LES PLACES,B066,12170,12092,Durenque,12,,,120920000E0183,,,,,,,,,,,,,0,,,,,T,terres,,,42337,2.584787,44.089828
2021-141567,2021-01-22,000001,Vente,58656,,,LA SALVETAT,B099,12170,12092,Durenque,12,,,120920000E0461,,,,,,,,,,,,,0,,,,,S,sols,,,1408,2.592718,44.095619
2021-141600,2021-01-14,000001,Vente,105000,5426,,LE PUECH DE ROUTABOUL,B080,12170,12092,Durenque,12,,,120920000A0623,,,,,,,,,,,,,0,1,Maison,186,5,S,sols,,,500,2.62137,44.118051
2021-141600,2021-01-14,000001,Vente,105000,5426,,LE PUECH DE ROUTABOUL,B080,12170,12092,Durenque,12,,,120920000A0623,,,,,,,,,,,,,0,3,Dépendance,,0,AG,terrains d'agrément,PARC,Parc,2362,2.62137,44.118051
2021-141600,2021-01-14,000001,Vente,105000,5426,,LE PUECH DE ROUTABOUL,B080,12170,12092,Durenque,12,,,120920000A0623,,,,,,,,,,,,,0,3,Dépendance,,0,S,sols,,,500,2.62137,44.118051
2021-141600,2021-01-14,000001,Vente,105000,5426,,LE PUECH DE ROUTABOUL,B080,12170,12092,Durenque,12,,,120920000A0623,,,,,,,,,,,,,0,1,Maison,186,5,AG,terrains d'agrément,PARC,Parc,2362,2.62137,44.118051
2021-141600,2021-01-14,000001,Vente,105000,,,LE PUECH DE ROUTABOUL,B080,12170,12092,Durenque,12,,,120920000A0624,,,,,,,,,,,,,0,,,,,S,sols,,,500,2.622098,44.117943
2021-141600,2021-01-14,000001,Vente,105000,,,LE PUECH DE ROUTABOUL,B080,12170,12092,Durenque,12,,,120920000A0624,,,,,,,,,,,,,0,,,,,AG,terrains d'agrément,PARC,Parc,3158,2.622098,44.117943
2021-141732,2021-01-19,000001,Vente,55000,5259,,CANNAC,B020,12170,12092,Durenque,12,,,120920000C0939,,,,,,,,,,,,,0,2,Appartement,80,3,S,sols,,,519,2.640992,44.093116
2021-141991,2021-02-02,000001,Vente,37000,,,LES PRES DE L ETANG,B071,12170,12092,Durenque,12,,,120920000B0134,,,,,,,,,,,,,0,,,,,J,jardins,,,380,2.620223,44.108729
2021-141991,2021-02-02,000001,Vente,37000,5055,,DURENQUE,B033,12170,12092,Durenque,12,,,120920000D0093,,,,,,,,,,,,,0,1,Maison,140,4,S,sols,,,139,2.619034,44.10932
2021-141991,2021-02-02,000001,Vente,37000,5055,,DURENQUE,B033,12170,12092,Durenque,12,,,120920000D0093,,,,,,,,,,,,,0,3,Dépendance,,0,S,sols,,,139,2.619034,44.10932
2021-142320,2021-02-16,000001,Vente,47000,,,DURENQUE,B033,12170,12092,Durenque,12,,,120920000D0157,,,,,,,,,,,,,0,,,,,J,jardins,,,393,2.617057,44.108881
2021-142320,2021-02-16,000001,Vente,47000,5022,,DURENQUE,B033,12170,12092,Durenque,12,,,120920000D0164,,,,,,,,,,,,,0,1,Maison,80,4,S,sols,,,58,2.617122,44.109121
2021-142750,2021-02-22,000001,Vente,76500,,,LES PLACES,B066,12170,12092,Durenque,12,,,120920000B0089,,,,,,,,,,,,,0,,,,,T,terres,,,49358,2.638211,44.098028
2021-142750,2021-02-22,000001,Vente,76500,,,LES PLACES,B066,12170,12092,Durenque,12,,,120920000B0091,,,,,,,,,,,,,0,,,,,T,terres,,,24470,2.636913,44.097198
2021-142750,2021-02-22,000001,Vente,76500,,,LES PLACES,B066,12170,12092,Durenque,12,,,120920000B0093,,,,,,,,,,,,,0,,,,,T,terres,,,16824,2.63478,44.097609
2021-142752,2021-02-22,000001,Vente,49000,,,LA TOURELLE,B108,12170,12092,Durenque,12,,,120920000C0060,,,,,,,,,,,,,0,,,,,T,terres,,,3060,2.637185,44.092575
2021-142752,2021-02-22,000001,Vente,49000,,,LA TOURELLE,B108,12170,12092,Durenque,12,,,120920000C0084,,,,,,,,,,,,,0,,,,,J,jardins,,,18,2.6383,44.09224
2021-142752,2021-02-22,000001,Vente,49000,,,MAZELS HAUT,B055,12170,12092,Durenque,12,,,120920000C0545,,,,,,,,,,,,,0,,,,,P,prés,,,15430,2.649928,44.085539
2021-142752,2021-02-22,000001,Vente,49000,,,LA PALE,B061,12170,12092,Durenque,12,,,120920000C0547,,,,,,,,,,,,,0,,,,,L,landes,PATUR,Pâture plantée,1883,2.650661,44.087133
2021-142752,2021-02-22,000001,Vente,49000,,,LA PALE,B061,12170,12092,Durenque,12,,,120920000C0548,,,,,,,,,,,,,0,,,,,T,terres,,,17146,2.65161,44.087648
2021-142752,2021-02-22,000001,Vente,49000,,,LA PALE,B061,12170,12092,Durenque,12,,,120920000C0549,,,,,,,,,,,,,0,,,,,BT,taillis simples,,,451,2.651831,44.08825
2021-142752,2021-02-22,000001,Vente,49000,,,LA PALE,B061,12170,12092,Durenque,12,,,120920000C0550,,,,,,,,,,,,,0,,,,,P,prés,,,7211,2.652778,44.087146
2021-142752,2021-02-22,000001,Vente,49000,,,LA PALE,B061,12170,12092,Durenque,12,,,120920000C0551,,,,,,,,,,,,,0,,,,,T,terres,,,26761,2.651462,44.085883
2021-142752,2021-02-22,000001,Vente,49000,,,LA PALE,B061,12170,12092,Durenque,12,,,120920000C0553,,,,,,,,,,,,,0,,,,,T,terres,,,2008,2.650622,44.085086
2021-142752,2021-02-22,000001,Vente,49000,,,LA PALE,B061,12170,12092,Durenque,12,,,120920000C0554,,,,,,,,,,,,,0,,,,,BT,taillis simples,,,2128,2.650408,44.085037
2021-142999,2021-03-23,000001,Vente,7500,,,SAINTE MARIE,B098,12170,12092,Durenque,12,,,120920000B0534,,,,,,,,,,,,,0,,,,,P,prés,,,8698,2.629244,44.110945
2021-142999,2021-03-23,000001,Vente,7500,,,SAINTE MARIE,B098,12170,12092,Durenque,12,,,120920000B0537,,,,,,,,,,,,,0,,,,,P,prés,,,361,2.628927,44.110142
2021-143994,2021-05-06,000001,Vente,7000,,,LES CAMBOUS,B016,12170,12092,Durenque,12,,,120920000D0260,,,,,,,,,,,,,0,,,,,T,terres,,,2120,2.617745,44.107206
2021-143994,2021-05-06,000001,Vente,7000,,,LES CAMBOUS,B016,12170,12092,Durenque,12,,,120920000D0260,,,,,,,,,,,,,0,,,,,T,terres,,,2120,2.617745,44.107206
2021-144030,2021-04-23,000001,Vente,20000,,,LES COMBETTES,B027,12170,12092,Durenque,12,,,120920000A0384,,,,,,,,,,,,,0,,,,,S,sols,,,99,2.619709,44.112387
2021-144030,2021-04-23,000001,Vente,20000,,,LES COMBETTES,B027,12170,12092,Durenque,12,,,120920000A0392,,,,,,,,,,,,,0,,,,,S,sols,,,20,,
2021-144030,2021-04-23,000001,Vente,20000,,,LES COMBETTES,B027,12170,12092,Durenque,12,,,120920000A0392,,,,,,,,,,,,,0,,,,,J,jardins,,,617,,
2021-144031,2021-04-23,000002,Vente,25000,5167,A,LES COMBETTES,B027,12170,12092,Durenque,12,,,120920000A0383,,,,,,,,,,,,,0,1,Maison,120,6,S,sols,,,99,2.619789,44.112355
2021-144031,2021-04-23,000002,Vente,25000,,,LES COMBETTES,B027,12170,12092,Durenque,12,,,120920000A0385,,,,,,,,,,,,,0,,,,,S,sols,,,195,2.620004,44.11229
2021-144031,2021-04-23,000002,Vente,25000,,,LES COMBETTES,B027,12170,12092,Durenque,12,,,120920000A0386,,,,,,,,,,,,,0,,,,,S,sols,,,180,2.620088,44.112291
2021-144031,2021-04-23,000002,Vente,25000,,,LES COMBETTES,B027,12170,12092,Durenque,12,,,120920000A0387,,,,,,,,,,,,,0,,,,,T,terres,,,746,2.620184,44.112459
2021-144031,2021-04-23,000002,Vente,25000,,,LES COMBETTES,B027,12170,12092,Durenque,12,,,120920000A0393,,,,,,,,,,,,,0,,,,,J,jardins,,,27,2.619839,44.112427
2021-144077,2021-05-05,000001,Vente,10500,,,LA VIDALIE,B110,12170,12092,Durenque,12,,,120920000E0444,,,,,,,,,,,,,0,,,,,P,prés,,,8745,2.607495,44.104371
2021-144238,2021-05-11,000001,Vente,55000,,,LA CARRADIE,B022,12170,12092,Durenque,12,,,120920000E0143,,,,,,,,,,,,,0,,,,,BT,taillis simples,,,15320,2.588412,44.101425
2021-144238,2021-05-11,000001,Vente,55000,5147,,LA CARRADIE,B022,12170,12092,Durenque,12,,,120920000E0366,,,,,,,,,,,,,0,1,Maison,40,2,S,sols,,,138,2.599614,44.100476
2021-144238,2021-05-11,000001,Vente,55000,5149,A,LA CARRADIE,B022,12170,12092,Durenque,12,,,120920000E0430,,,,,,,,,,,,,0,1,Maison,94,5,S,sols,,,1161,2.59984,44.100461
2021-144238,2021-05-11,000001,Vente,55000,,,LA CARRADIE,B022,12170,12092,Durenque,12,,,120920000E0432,,,,,,,,,,,,,0,,,,,T,terres,,,1456,2.599621,44.100484
2021-144238,2021-05-11,000001,Vente,55000,,,LA CARRADIE,B022,12170,12092,Durenque,12,,,120920000E0433,,,,,,,,,,,,,0,,,,,P,prés,,,85,2.600076,44.100757
2021-144447,2021-05-25,000002,Vente,157.5,,,GINESTOUZET,B042,12170,12092,Durenque,12,,,120920000A0677,,,,,,,,,,,,,0,,,,,S,sols,,,105,,
2021-144453,2021-05-22,000001,Vente,12000,,,LA SABLONIE,B095,12170,12092,Durenque,12,,,120920000C0586,,,,,,,,,,,,,0,,,,,S,sols,,,395,2.656756,44.079839
2021-144453,2021-05-22,000001,Vente,12000,,,LA SABLONIE,B095,12170,12092,Durenque,12,,,120920000C0587,,,,,,,,,,,,,0,,,,,L,landes,PATUR,Pâture plantée,65,2.656661,44.079828
2021-144453,2021-05-22,000001,Vente,12000,,,LA SABLONIE,B095,12170,12092,Durenque,12,,,120920000C0812,,,,,,,,,,,,,0,,,,,T,terres,,,54,2.656475,44.079911
2021-144453,2021-05-22,000001,Vente,12000,,,LA SABLONIE,B095,12170,12092,Durenque,12,,,120920000C0814,,,,,,,,,,,,,0,,,,,L,landes,PATUR,Pâture plantée,136,2.656696,44.080013
2021-144861,2021-06-03,000001,Vente,96000,5411,,LOT LE HAMEAU DES GENETS,A100,12170,12092,Durenque,12,,,120920000D1152,,,,,,,,,,,,,0,1,Maison,51,2,S,sols,,,400,2.618156,44.107499
2021-145263,2021-06-30,000001,Vente,138000,5414,,LOT LE HAMEAU DES GENETS,A100,12170,12092,Durenque,12,,,120920000D1153,,,,,,,,,,,,,0,1,Maison,112,4,S,sols,,,754,2.618323,44.10729
2021-145263,2021-06-30,000001,Vente,138000,,,DURENQUE,B033,12170,12092,Durenque,12,,,120920000D1270,,,,,,,,,,,,,0,,,,,AB,terrains a bâtir,,,163,2.618527,44.107322
2021-145403,2021-06-25,000001,Vente,222000,5262,,LA SABLONIE,B095,12170,12092,Durenque,12,,,120920000C0767,,,,,,,,,,,,,0,1,Maison,141,6,AG,terrains d'agrément,PARC,Parc,1298,2.654653,44.084603
2021-145403,2021-06-25,000001,Vente,222000,5262,,LA SABLONIE,B095,12170,12092,Durenque,12,,,120920000C0767,,,,,,,,,,,,,0,1,Maison,141,6,S,sols,,,1610,2.654653,44.084603
2021-145403,2021-06-25,000001,Vente,222000,,,LA SABLONIE,B095,12170,12092,Durenque,12,,,120920000C0802,,,,,,,,,,,,,0,,,,,T,terres,,,234,2.655001,44.084337
2021-145403,2021-06-25,000001,Vente,222000,,,LA SABLONIE,B095,12170,12092,Durenque,12,,,120920000C0802,,,,,,,,,,,,,0,,,,,T,terres,,,234,2.655001,44.084337
2021-145403,2021-06-25,000001,Vente,222000,,,LA SABLONIE,B095,12170,12092,Durenque,12,,,120920000C0804,,,,,,,,,,,,,0,,,,,T,terres,,,410,2.654514,44.084196
2021-145403,2021-06-25,000001,Vente,222000,,,LA SABLONIE,B095,12170,12092,Durenque,12,,,120920000C0807,,,,,,,,,,,,,0,,,,,T,terres,,,27,2.654876,44.084155
2021-146156,2021-07-15,000001,Vente,3000,,,DURENQUE,B033,12170,12092,Durenque,12,,,120920000D0094,,,,,,,,,,,,,0,,,,,S,sols,,,108,2.619086,44.109255
2021-146156,2021-07-15,000001,Vente,3000,,,DURENQUE,B033,12170,12092,Durenque,12,,,120920000D0096,,,,,,,,,,,,,0,,,,,S,sols,,,34,2.61908,44.109196
2021-146561,2021-08-28,000001,Vente,30000,5110,,LE VERDIER,B109,12170,12092,Durenque,12,,,120920000C0266,,,,,,,,,,,,,0,2,Appartement,75,3,S,sols,,,888,2.617227,44.08011
2021-146657,2021-08-06,000002,Vente,90000,,,DURENQUE,B033,12170,12092,Durenque,12,,,120920000D1354,,,,,,,,,,,,,0,,,,,J,jardins,,,269,2.616468,44.109781
2021-146657,2021-08-06,000002,Vente,90000,5080,,DURENQUE,B033,12170,12092,Durenque,12,,,120920000D1356,,,,,,,,,,,,,0,4,Local industriel. commercial ou assimilé,200,0,S,sols,,,254,2.616307,44.109838
2021-146657,2021-08-06,000002,Vente,90000,5080,,DURENQUE,B033,12170,12092,Durenque,12,,,120920000D1356,,,,,,,,,,,,,0,3,Dépendance,,0,S,sols,,,254,2.616307,44.109838
2021-146657,2021-08-06,000002,Vente,90000,5080,,DURENQUE,B033,12170,12092,Durenque,12,,,120920000D1356,,,,,,,,,,,,,0,3,Dépendance,,0,S,sols,,,254,2.616307,44.109838
2021-146657,2021-08-06,000002,Vente,90000,5080,,DURENQUE,B033,12170,12092,Durenque,12,,,120920000D1356,,,,,,,,,,,,,0,2,Appartement,70,3,S,sols,,,254,2.616307,44.109838
2021-146657,2021-08-06,000002,Vente,90000,5080,,DURENQUE,B033,12170,12092,Durenque,12,,,120920000D1356,,,,,,,,,,,,,0,2,Appartement,97,4,S,sols,,,254,2.616307,44.109838
2021-146657,2021-08-06,000002,Vente,90000,5080,,DURENQUE,B033,12170,12092,Durenque,12,,,120920000D1356,,,,,,,,,,,,,0,2,Appartement,90,6,S,sols,,,254,2.616307,44.109838
2021-146657,2021-08-06,000002,Vente,90000,5080,,DURENQUE,B033,12170,12092,Durenque,12,,,120920000D1356,,,,,,,,,,,,,0,4,Local industriel. commercial ou assimilé,140,0,S,sols,,,254,2.616307,44.109838
2021-147063,2021-09-09,000001,Vente,236085,,,LES PLOS,B068,12170,12092,Durenque,12,,,120920000B0402,,,,,,,,,,,,,0,,,,,S,sols,,,4964,2.641139,44.094134
2021-147063,2021-09-09,000001,Vente,236085,,,CANNAC,B020,12170,12092,Durenque,12,,,120920000C0127,,,,,,,,,,,,,0,,,,,S,sols,,,860,2.640914,44.094156
2021-147478,2021-09-23,000001,Vente,5000,,,MONTMEJA,B057,12170,12092,Durenque,12,,,120920000D0770,,,,,,,,,,,,,0,,,,,T,terres,,,3320,2.6054,44.082619
2021-147478,2021-09-23,000001,Vente,5000,,,MONTMEJA,B057,12170,12092,Durenque,12,,,120920000D0771,,,,,,,,,,,,,0,,,,,BT,taillis simples,,,4460,2.605419,44.083985
2021-148225,2021-10-20,000002,Vente,167000,5439,,LE VERDIER,B109,12170,12092,Durenque,12,,,120920000C0235,,,,,,,,,,,,,0,1,Maison,168,4,S,sols,,,393,2.616683,44.077673
2021-148225,2021-10-20,000002,Vente,167000,,,LE VERDIER,B109,12170,12092,Durenque,12,,,120920000C0895,,,,,,,,,,,,,0,,,,,S,sols,,,81,2.616361,44.077831
2021-148225,2021-10-20,000002,Vente,167000,,,LE VERDIER,B109,12170,12092,Durenque,12,,,120920000C0896,,,,,,,,,,,,,0,,,,,S,sols,,,255,2.616365,44.077767
2021-148225,2021-10-20,000002,Vente,167000,5114,,LE VERDIER,B109,12170,12092,Durenque,12,,,120920000C0898,,,,,,,,,,,,,0,1,Maison,127,5,S,sols,,,130,2.616635,44.07784
2021-148225,2021-10-20,000002,Vente,167000,,,LE VERDIER,B109,12170,12092,Durenque,12,,,120920000C0911,,,,,,,,,,,,,0,,,,,S,sols,,,295,2.616628,44.077574
2021-148225,2021-10-20,000002,Vente,167000,,,LE VERDIER,B109,12170,12092,Durenque,12,,,120920000C1021,,,,,,,,,,,,,0,,,,,S,sols,,,334,2.616491,44.077903
2021-148225,2021-10-20,000002,Vente,167000,,,LE VERDIER,B109,12170,12092,Durenque,12,,,120920000C1022,,,,,,,,,,,,,0,,,,,S,sols,,,552,2.616542,44.077731
2021-148390,2021-10-30,000001,Vente,1,,,LE VERDIER,B109,12170,12092,Durenque,12,,,120920000C1023,,,,,,,,,,,,,0,,,,,S,sols,,,26,2.616314,44.077623
2021-148516,2021-11-05,000001,Vente,5460,,,LOT LES HAUTS DE GRELAC 1,A125,12170,12092,Durenque,12,,,120920000D1314,,,,,,,,,,,,,0,,,,,AB,terrains a bâtir,,,445,2.615716,44.108556
2021-148930,2021-11-23,000001,Vente,9792,,,LOT LES HAUTS DE GRELAC 2,A126,12170,12092,Durenque,12,,,120920000D1315,,,,,,,,,,,,,0,,,,,AB,terrains a bâtir,,,816,2.616042,44.108272
2021-149878,2021-12-20,000001,Vente,45000,5059,,DURENQUE,B033,12170,12092,Durenque,12,,,120920000D0087,,,,,,,,,,,,,0,1,Maison,140,5,S,sols,,,94,2.618523,44.10938
