id_mutation,date_mutation,numero_disposition,nature_mutation,valeur_fonciere,adresse_numero,adresse_suffixe,adresse_nom_voie,adresse_code_voie,code_postal,code_commune,nom_commune,code_departement,ancien_code_commune,ancien_nom_commune,id_parcelle,ancien_id_parcelle,numero_volume,lot1_numero,lot1_surface_carrez,lot2_numero,lot2_surface_carrez,lot3_numero,lot3_surface_carrez,lot4_numero,lot4_surface_carrez,lot5_numero,lot5_surface_carrez,nombre_lots,code_type_local,type_local,surface_reelle_bati,nombre_pieces_principales,code_nature_culture,nature_culture,code_nature_culture_speciale,nature_culture_speciale,surface_terrain,longitude,latitude
2021-141407,2021-01-06,000001,Vente,78400,21,,RUE PAUL VERLAINE,0219,12850,12176,Onet-le-Château,12,,,12176000AW0330,,,25,,,,,,,,,,1,2,Appartement,34,2,,,,,,2.552837,44.375095
2021-141407,2021-01-06,000001,Vente,78400,21,,RUE PAUL VERLAINE,0219,12850,12176,Onet-le-Château,12,,,12176000AW0330,,,20,,,,,,,,,,1,3,Dépendance,,0,,,,,,2.552837,44.375095
2021-141411,2021-01-05,000001,Vente en l'état futur d'achèvement,174750,,,BD DES CAPUCINES,0070,12850,12176,Onet-le-Château,12,,,12176000BE0539,,,36,,,,,,,,,,1,,,,,,,,,,2.597257,44.364154
2021-141411,2021-01-05,000001,Vente en l'état futur d'achèvement,174750,,,BD DES CAPUCINES,0070,12850,12176,Onet-le-Château,12,,,12176000BE0539,,,58,,,,,,,,,,1,,,,,,,,,,2.597257,44.364154
2021-141411,2021-01-05,000001,Vente en l'état futur d'achèvement,174750,,,BD DES CAPUCINES,0070,12850,12176,Onet-le-Château,12,,,12176000BE0539,,,201,,,,,,,,,,1,,,,,,,,,,2.597257,44.364154
2021-141443,2021-01-04,000001,Vente,90000,20,,AV DES NATIONS,0228,12850,12176,Onet-le-Château,12,,,12176000BD0917,,,2154,,,,,,,,,,1,3,Dépendance,,0,,,,,,2.579909,44.364743
2021-141443,2021-01-04,000001,Vente,90000,20,,AV DES NATIONS,0228,12850,12176,Onet-le-Château,12,,,12176000BD0917,,,2005,51.2,,,,,,,,,1,2,Appartement,51,3,,,,,,2.579909,44.364743
2021-141464,2021-01-14,000001,Vente,114000,24,,AV DES CYGNES,0107,12850,12176,Onet-le-Château,12,,,12176000AX0578,,,29,,72,,,,,,,,2,2,Appartement,63,3,,,,,,2.56638,44.374791
2021-141465,2021-01-14,000001,Vente,83000,1,,IMP DES JARDINS,0146,12850,12176,Onet-le-Château,12,,,12176000BD0917,,,3154,,,,,,,,,,1,3,Dépendance,,0,,,,,,2.579909,44.364743
2021-141465,2021-01-14,000001,Vente,83000,1,,IMP DES JARDINS,0146,12850,12176,Onet-le-Château,12,,,12176000BD0917,,,3057,,,,,,,,,,1,2,Appartement,41,2,,,,,,2.579909,44.364743
2021-141470,2021-01-08,000001,Vente,187000,30,,RTE DE SEVERAC,0345,12850,12176,Onet-le-Château,12,,,12176000BX0240,,,,,,,,,,,,,0,1,Maison,105,6,S,sols,,,419,2.589985,44.362732
2021-141484,2021-01-13,000001,Vente,360000,5,,RUE CHATEAUBRIAND,0087,12850,12176,Onet-le-Château,12,,,12176000AW0073,,,,,,,,,,,,,0,1,Maison,166,4,S,sols,,,849,2.555432,44.371053
2021-141518,2021-01-05,000001,Vente,180000,9001,,LA GAFFARDIE,B133,12850,12176,Onet-le-Château,12,,,12176000BD1037,,,,,,,,,,,,,0,4,Local industriel. commercial ou assimilé,730,0,S,sols,,,1092,2.575765,44.365018
2021-141527,2021-01-04,000001,Vente,64590,62,,RTE D ESPALION,0115,12850,12176,Onet-le-Château,12,,,12176000BY0440,,,72,37.78,,,,,,,,,1,2,Appartement,37,2,,,,,,2.590427,44.369073
2021-141527,2021-01-04,000001,Vente,64590,62,,RTE D ESPALION,0115,12850,12176,Onet-le-Château,12,,,12176000BY0440,,,9,,,,,,,,,,1,3,Dépendance,,0,,,,,,2.590427,44.369073
2021-141532,2021-01-04,000001,Vente en l'état futur d'achèvement,111000,,,BD DES CAPUCINES,0070,12850,12176,Onet-le-Château,12,,,12176000BE0539,,,118,,,,,,,,,,1,,,,,,,,,,2.597257,44.364154
2021-141532,2021-01-04,000001,Vente en l'état futur d'achèvement,111000,,,BD DES CAPUCINES,0070,12850,12176,Onet-le-Château,12,,,12176000BE0539,,,4,,,,,,,,,,1,,,,,,,,,,2.597257,44.364154
2021-141535,2021-01-22,000001,Vente,136275,8,,AV DES ROSIERS,0300,12850,12176,Onet-le-Château,12,,,12176000BX0010,,,,,,,,,,,,,0,1,Maison,72,4,S,sols,,,294,2.596749,44.363375
2021-141536,2021-01-21,000001,Vente,21000,62,,RTE D ESPALION,0115,12850,12176,Onet-le-Château,12,,,12176000BY0440,,,42,,,,,,,,,,1,3,Dépendance,,0,,,,,,2.590427,44.369073
2021-141544,2021-01-07,000001,Vente,212000,18,,RUE DES CRETES,0103,12850,12176,Onet-le-Château,12,,,12176000BE0418,,,,,,,,,,,,,0,1,Maison,81,4,S,sols,,,685,2.599979,44.366596
2021-141544,2021-01-07,000001,Vente,212000,9001,,RUE DES NARCISSES,0225,12850,12176,Onet-le-Château,12,,,12176000BE0430,,,,,,,,,,,,,0,4,Local industriel. commercial ou assimilé,,0,S,sols,,,31,2.596798,44.368085
2021-141544,2021-01-07,000001,Vente,212000,,,CAMP DE BANCAREL,B032,12850,12176,Onet-le-Château,12,,,12176000BE0433,,,,,,,,,,,,,0,,,,,AB,terrains a bâtir,RUE,Rue,66,2.597624,44.368027
2021-141544,2021-01-07,000001,Vente,212000,,,RUE DES CRETES,0103,12850,12176,Onet-le-Château,12,,,12176000BE0434,,,,,,,,,,,,,0,,,,,AB,terrains a bâtir,RUE,Rue,48,2.599526,44.367677
2021-141549,2021-01-25,000001,Vente en l'état futur d'achèvement,123000,29,,AV DES CYGNES,0107,12850,12176,Onet-le-Château,12,,,12176000AX1010,,,18,,,,,,,,,,1,,,,,,,,,,2.5683,44.374015
2021-141549,2021-01-25,000001,Vente en l'état futur d'achèvement,123000,29,,AV DES CYGNES,0107,12850,12176,Onet-le-Château,12,,,12176000AX1010,,,50,,,,,,,,,,1,,,,,,,,,,2.5683,44.374015
2021-141549,2021-01-25,000001,Vente en l'état futur d'achèvement,123000,29,,AV DES CYGNES,0107,12850,12176,Onet-le-Château,12,,,12176000AX1010,,,3,,,,,,,,,,1,,,,,,,,,,2.5683,44.374015
2021-141599,2021-01-12,000001,Vente,105000,37,,RTE D ESPALION,0115,12850,12176,Onet-le-Château,12,,,12176000BD0654,,,67,61.06,,,,,,,,,1,2,Appartement,61,3,,,,,,2.585919,44.366361
2021-141599,2021-01-12,000001,Vente,105000,37,,RTE D ESPALION,0115,12850,12176,Onet-le-Château,12,,,12176000BD0654,,,39,,,,,,,,,,1,3,Dépendance,,0,,,,,,2.585919,44.366361
2021-141604,2021-01-13,000001,Vente,161158,21,,RUE PAUL VERLAINE,0219,12850,12176,Onet-le-Château,12,,,12176000AW0330,,,4,,,,,,,,,,1,3,Dépendance,,0,,,,,,2.552837,44.375095
2021-141604,2021-01-13,000001,Vente,161158,21,,RUE PAUL VERLAINE,0219,12850,12176,Onet-le-Château,12,,,12176000AW0330,,,10,,,,,,,,,,1,3,Dépendance,,0,,,,,,2.552837,44.375095
2021-141604,2021-01-13,000001,Vente,161158,21,,RUE PAUL VERLAINE,0219,12850,12176,Onet-le-Château,12,,,12176000AW0330,,,12,66,,,,,,,,,1,2,Appartement,64,3,,,,,,2.552837,44.375095
2021-141626,2021-01-25,000001,Vente,10000,,,LES COSTES,B096,12850,12176,Onet-le-Château,12,,,12176000BI0490,,,,,,,,,,,,,0,,,,,CA,carrières,,,868,2.597451,44.382167
2021-141626,2021-01-25,000001,Vente,10000,,,LES COSTES,B096,12850,12176,Onet-le-Château,12,,,12176000BI0492,,,,,,,,,,,,,0,,,,,L,landes,PATUR,Pâture plantée,532,2.597573,44.382312
2021-141626,2021-01-25,000001,Vente,10000,,,LES COSTES,B096,12850,12176,Onet-le-Château,12,,,12176000BI0493,,,,,,,,,,,,,0,,,,,L,landes,PATUR,Pâture plantée,1027,2.597754,44.382336
2021-141626,2021-01-25,000001,Vente,10000,,,LES PLOS,B199,12850,12176,Onet-le-Château,12,,,12176000BI0496,,,,,,,,,,,,,0,,,,,CA,carrières,,,29,2.59818,44.382241
2021-141628,2021-01-21,000001,Vente,2500,,,RUE DES PINS,0257,12850,12176,Onet-le-Château,12,,,12176000BC0528,,,9,,,,,,,,,,1,3,Dépendance,,0,,,,,,2.58,44.377328
2021-141642,2021-01-22,000001,Vente,25400,,,MANAU,B162,12850,12176,Onet-le-Château,12,,,12176000AI0050,,,,,,,,,,,,,0,,,,,L,landes,PATUR,Pâture plantée,17479,2.499311,44.383547
2021-141646,2021-01-19,000001,Vente en l'état futur d'achèvement,95000,,,BD DES CAPUCINES,0070,12850,12176,Onet-le-Château,12,,,12176000BE0539,,,29,,,,,,,,,,1,,,,,,,,,,2.597257,44.364154
2021-141646,2021-01-19,000001,Vente en l'état futur d'achèvement,95000,,,BD DES CAPUCINES,0070,12850,12176,Onet-le-Château,12,,,12176000BE0539,,,103,,,,,,,,,,1,,,,,,,,,,2.597257,44.364154
2021-141722,2021-01-15,000001,Vente,178000,,,LES BADESSES,B005,12850,12176,Onet-le-Château,12,,,12176000AS0269,,,,,,,,,,,,,0,,,,,AB,terrains a bâtir,,,3049,2.55779,44.399714
2021-141729,2021-01-27,000001,Vente,8000,9002,,RUE DE LA VIEILLE GARE,0387,12850,12176,Onet-le-Château,12,,,12176000BD0998,,,97,,,,,,,,,,1,3,Dépendance,,0,,,,,,2.576592,44.366632
2021-141736,2021-02-01,000001,Vente en l'état futur d'achèvement,133000,,,,,,12176,Onet-le-Château,12,,,12176000BC0525,,,70,,,,,,,,,,1,,,,,,,,,,2.58034,44.378157
2021-141736,2021-02-01,000001,Vente en l'état futur d'achèvement,133000,,,,,,12176,Onet-le-Château,12,,,12176000BC0525,,,61,,,,,,,,,,1,,,,,,,,,,2.58034,44.378157
2021-141736,2021-02-01,000001,Vente en l'état futur d'achèvement,133000,,,,,,12176,Onet-le-Château,12,,,12176000BC0525,,,78,,,,,,,,,,1,,,,,,,,,,2.58034,44.378157
2021-141789,2021-01-12,000001,Vente,172000,31,,AV DES CYGNES,0107,12850,12176,Onet-le-Château,12,,,12176000AX1009,,,28,,,,,,,,,,1,2,Appartement,72,3,,,,,,2.568981,44.37374
2021-141789,2021-01-12,000001,Vente,172000,31,,AV DES CYGNES,0107,12850,12176,Onet-le-Château,12,,,12176000AX1009,,,2,,,,,,,,,,1,3,Dépendance,,0,,,,,,2.568981,44.37374
2021-141791,2021-01-25,000001,Vente,134000,205,,RUE SAINT FIRMIN,0316,12850,12176,Onet-le-Château,12,,,12176000BD0840,,,35,80.5,37,,,,,,,,2,2,Appartement,76,3,,,,,,2.584821,44.367131
2021-141791,2021-01-25,000001,Vente,134000,205,,RUE SAINT FIRMIN,0316,12850,12176,Onet-le-Château,12,,,12176000BD0840,,,20,,,,,,,,,,1,3,Dépendance,,0,,,,,,2.584821,44.367131
2021-141791,2021-01-25,000001,Vente,134000,205,,RUE SAINT FIRMIN,0316,12850,12176,Onet-le-Château,12,,,12176000BD0840,,,35,80.5,37,,,,,,,,2,3,Dépendance,,0,,,,,,2.584821,44.367131
2021-141925,2021-02-03,000001,Vente,65000,21,,AV DES NATIONS,0228,12850,12176,Onet-le-Château,12,,,12176000BD0917,,,1065,,,,,,,,,,1,2,Appartement,33,2,,,,,,2.579909,44.364743
2021-141925,2021-02-03,000001,Vente,65000,21,,AV DES NATIONS,0228,12850,12176,Onet-le-Château,12,,,12176000BD0917,,,1111,,,,,,,,,,1,3,Dépendance,,0,,,,,,2.579909,44.364743
2021-141944,2021-01-29,000002,Vente,811856,480,,AV JOEL PILON,0153,12850,12176,Onet-le-Château,12,,,12176000BI0635,,,,,,,,,,,,,0,4,Local industriel. commercial ou assimilé,265,0,S,sols,,,548,2.602906,44.393196
2021-141944,2021-01-29,000002,Vente,811856,480,,AV JOEL PILON,0153,12850,12176,Onet-le-Château,12,,,12176000BI0635,,,,,,,,,,,,,0,4,Local industriel. commercial ou assimilé,168,0,S,sols,,,548,2.602906,44.393196
2021-141944,2021-01-29,000002,Vente,811856,480,,AV JOEL PILON,0153,12850,12176,Onet-le-Château,12,,,12176000BI0635,,,,,,,,,,,,,0,4,Local industriel. commercial ou assimilé,53785,0,S,sols,,,548,2.602906,44.393196
2021-141944,2021-01-29,000002,Vente,811856,480,,AV JOEL PILON,0153,12850,12176,Onet-le-Château,12,,,12176000BI0635,,,,,,,,,,,,,0,4,Local industriel. commercial ou assimilé,195,0,S,sols,,,548,2.602906,44.393196
2021-141944,2021-01-29,000002,Vente,811856,480,,AV JOEL PILON,0153,12850,12176,Onet-le-Château,12,,,12176000BI0635,,,,,,,,,,,,,0,4,Local industriel. commercial ou assimilé,302,0,S,sols,,,548,2.602906,44.393196
2021-141944,2021-01-29,000002,Vente,811856,480,,AV JOEL PILON,0153,12850,12176,Onet-le-Château,12,,,12176000BI0635,,,,,,,,,,,,,0,4,Local industriel. commercial ou assimilé,1239,0,S,sols,,,548,2.602906,44.393196
2021-141956,2021-01-22,000001,Vente,134900,12,,RUE DES GRIVES,0147,12850,12176,Onet-le-Château,12,,,12176000AX1042,,,,,,,,,,,,,0,1,Maison,87,4,S,sols,,,250,2.570002,44.380742
2021-141956,2021-01-22,000001,Vente,134900,12,,RUE DES GRIVES,0147,12850,12176,Onet-le-Château,12,,,12176000AX1042,,,,,,,,,,,,,0,1,Maison,84,4,S,sols,,,250,2.570002,44.380742
2021-141956,2021-01-22,000001,Vente,134900,12,,RUE DES GRIVES,0147,12850,12176,Onet-le-Château,12,,,12176000AX1042,,,,,,,,,,,,,0,1,Maison,87,4,S,sols,,,250,2.570002,44.380742
2021-141956,2021-01-22,000001,Vente,134900,12,,RUE DES GRIVES,0147,12850,12176,Onet-le-Château,12,,,12176000AX1042,,,,,,,,,,,,,0,1,Maison,84,4,S,sols,,,250,2.570002,44.380742
2021-141956,2021-01-22,000001,Vente,134900,12,,RUE DES GRIVES,0147,12850,12176,Onet-le-Château,12,,,12176000AX1042,,,,,,,,,,,,,0,1,Maison,87,4,S,sols,,,250,2.570002,44.380742
2021-141956,2021-01-22,000001,Vente,134900,12,,RUE DES GRIVES,0147,12850,12176,Onet-le-Château,12,,,12176000AX1042,,,,,,,,,,,,,0,1,Maison,84,4,S,sols,,,250,2.570002,44.380742
2021-141956,2021-01-22,000001,Vente,134900,12,,RUE DES GRIVES,0147,12850,12176,Onet-le-Château,12,,,12176000AX1042,,,,,,,,,,,,,0,1,Maison,91,4,S,sols,,,250,2.570002,44.380742
2021-141956,2021-01-22,000001,Vente,134900,12,,RUE DES GRIVES,0147,12850,12176,Onet-le-Château,12,,,12176000AX1042,,,,,,,,,,,,,0,1,Maison,87,4,S,sols,,,250,2.570002,44.380742
2021-141956,2021-01-22,000001,Vente,134900,12,,RUE DES GRIVES,0147,12850,12176,Onet-le-Château,12,,,12176000AX1042,,,,,,,,,,,,,0,1,Maison,84,4,S,sols,,,250,2.570002,44.380742
2021-141956,2021-01-22,000001,Vente,134900,12,,RUE DES GRIVES,0147,12850,12176,Onet-le-Château,12,,,12176000AX1042,,,,,,,,,,,,,0,1,Maison,87,4,S,sols,,,250,2.570002,44.380742
2021-141956,2021-01-22,000001,Vente,134900,12,,RUE DES GRIVES,0147,12850,12176,Onet-le-Château,12,,,12176000AX1042,,,,,,,,,,,,,0,1,Maison,91,4,S,sols,,,250,2.570002,44.380742
2021-141956,2021-01-22,000001,Vente,134900,12,,RUE DES GRIVES,0147,12850,12176,Onet-le-Château,12,,,12176000AX1042,,,,,,,,,,,,,0,1,Maison,91,4,S,sols,,,250,2.570002,44.380742
2021-141987,2021-01-29,000001,Vente,715110,9010,,LES CARRIERES,B052,12850,12176,Onet-le-Château,12,,,12176000AS0225,,,,,,,,,,,,,0,1,Maison,187,4,AG,terrains d'agrément,PARC,Parc,4000,2.55858,44.400606
2021-141987,2021-01-29,000001,Vente,715110,9010,,LES CARRIERES,B052,12850,12176,Onet-le-Château,12,,,12176000AS0225,,,,,,,,,,,,,0,4,Local industriel. commercial ou assimilé,43,0,AG,terrains d'agrément,PARC,Parc,4000,2.55858,44.400606
2021-141987,2021-01-29,000001,Vente,715110,9010,,LES CARRIERES,B052,12850,12176,Onet-le-Château,12,,,12176000AS0225,,,,,,,,,,,,,0,3,Dépendance,,0,AG,terrains d'agrément,PARC,Parc,4000,2.55858,44.400606
2021-141987,2021-01-29,000001,Vente,715110,9010,,LES CARRIERES,B052,12850,12176,Onet-le-Château,12,,,12176000AS0225,,,,,,,,,,,,,0,3,Dépendance,,0,AG,terrains d'agrément,PARC,Parc,4000,2.55858,44.400606
2021-141987,2021-01-29,000001,Vente,715110,9010,,LES CARRIERES,B052,12850,12176,Onet-le-Château,12,,,12176000AS0225,,,,,,,,,,,,,0,3,Dépendance,,0,S,sols,,,1000,2.55858,44.400606
2021-141987,2021-01-29,000001,Vente,715110,9010,,LES CARRIERES,B052,12850,12176,Onet-le-Château,12,,,12176000AS0225,,,,,,,,,,,,,0,3,Dépendance,,0,S,sols,,,1000,2.55858,44.400606
2021-141987,2021-01-29,000001,Vente,715110,9010,,LES CARRIERES,B052,12850,12176,Onet-le-Château,12,,,12176000AS0225,,,,,,,,,,,,,0,1,Maison,187,4,S,sols,,,1000,2.55858,44.400606
2021-141987,2021-01-29,000001,Vente,715110,9010,,LES CARRIERES,B052,12850,12176,Onet-le-Château,12,,,12176000AS0225,,,,,,,,,,,,,0,4,Local industriel. commercial ou assimilé,43,0,S,sols,,,1000,2.55858,44.400606
2021-141987,2021-01-29,000001,Vente,715110,,,LES CARRIERES,B052,12850,12176,Onet-le-Château,12,,,12176000AS0250,,,,,,,,,,,,,0,,,,,P,prés,,,2500,2.558511,44.401158
2021-142015,2021-02-05,000001,Vente,252000,19,,RUE DU CAMP FRANC,0052,12850,12176,Onet-le-Château,12,,,12176000BD0747,,,,,,,,,,,,,0,1,Maison,126,4,S,sols,,,443,2.585058,44.365215
2021-142043,2021-02-05,000001,Vente,100550,34,,RUE DES ERABLES,0113,12850,12176,Onet-le-Château,12,,,12176000BC0535,,,94,40.09,,,,,,,,,1,2,Appartement,40,2,,,,,,2.581703,44.376564
2021-142043,2021-02-05,000001,Vente,100550,34,,RUE DES ERABLES,0113,12850,12176,Onet-le-Château,12,,,12176000BC0535,,,11,,,,,,,,,,1,3,Dépendance,,0,,,,,,2.581703,44.376564
2021-142057,2021-02-10,000001,Vente en l'état futur d'achèvement,99166,,,RUE DES PINS,0257,12850,12176,Onet-le-Château,12,,,12176000BC0525,,,71,,,,,,,,,,1,,,,,,,,,,2.58034,44.378157
2021-142057,2021-02-10,000001,Vente en l'état futur d'achèvement,99166,,,RUE DES PINS,0257,12850,12176,Onet-le-Château,12,,,12176000BC0525,,,73,,,,,,,,,,1,,,,,,,,,,2.58034,44.378157
2021-142065,2021-02-05,000001,Vente,159500,11,,RUE DES ROUGES GORGES,0308,12850,12176,Onet-le-Château,12,,,12176000AX0148,,,,,,,,,,,,,0,1,Maison,101,5,S,sols,,,242,2.572089,44.378616
2021-142115,2021-02-19,000001,Vente,281100,7,,RUE DU CLAUX,0042,12850,12176,Onet-le-Château,12,,,12176000BD0696,,,,,,,,,,,,,0,1,Maison,145,4,S,sols,,,486,2.582481,44.367016
2021-142115,2021-02-19,000001,Vente,281100,,,CANAC,B039,12850,12176,Onet-le-Château,12,,,12176000BD0939,,,,,,,,,,,,,0,,,,,AG,terrains d'agrément,PARC,Parc,89,2.582319,44.366926
2021-142183,2021-02-02,000001,Vente,85000,37,,RTE D ESPALION,0115,12850,12176,Onet-le-Château,12,,,12176000BD0654,,,22,,,,,,,,,,1,3,Dépendance,,0,,,,,,2.585919,44.366361
2021-142183,2021-02-02,000001,Vente,85000,37,,RTE D ESPALION,0115,12850,12176,Onet-le-Château,12,,,12176000BD0654,,,52,,,,,,,,,,1,2,Appartement,42,2,,,,,,2.585919,44.366361
2021-142290,2021-02-09,000001,Vente,120000,173,,RUE DES BLEUETS,0025,12850,12176,Onet-le-Château,12,,,12176000BE0073,,,,,,,,,,,,,0,1,Maison,73,4,S,sols,,,453,2.601302,44.364778
2021-142332,2021-02-18,000001,Vente,122100,34,,RUE DES ERABLES,0113,12850,12176,Onet-le-Château,12,,,12176000BC0535,,,41,,53,,,,,,,,2,2,Appartement,47,2,,,,,,2.581703,44.376564
2021-142332,2021-02-18,000001,Vente,122100,34,,RUE DES ERABLES,0113,12850,12176,Onet-le-Château,12,,,12176000BC0535,,,35,,,,,,,,,,1,3,Dépendance,,0,,,,,,2.581703,44.376564
2021-142332,2021-02-18,000001,Vente,122100,34,,RUE DES ERABLES,0113,12850,12176,Onet-le-Château,12,,,12176000BC0535,,,41,,53,,,,,,,,2,3,Dépendance,,0,,,,,,2.581703,44.376564
2021-142334,2021-02-18,000001,Vente en l'état futur d'achèvement,117000,,,BD DES CAPUCINES,0070,12850,12176,Onet-le-Château,12,,,12176000BE0539,,,202,,,,,,,,,,1,,,,,,,,,,2.597257,44.364154
2021-142334,2021-02-18,000001,Vente en l'état futur d'achèvement,117000,,,BD DES CAPUCINES,0070,12850,12176,Onet-le-Château,12,,,12176000BE0539,,,26,,,,,,,,,,1,,,,,,,,,,2.597257,44.364154
2021-142340,2021-02-18,000001,Vente en l'état futur d'achèvement,120500,,,BD DES CAPUCINES,0070,12850,12176,Onet-le-Château,12,,,12176000BE0539,,,17,,,,,,,,,,1,,,,,,,,,,2.597257,44.364154
2021-142340,2021-02-18,000001,Vente en l'état futur d'achèvement,120500,,,BD DES CAPUCINES,0070,12850,12176,Onet-le-Château,12,,,12176000BE0539,,,108,,,,,,,,,,1,,,,,,,,,,2.597257,44.364154
2021-142340,2021-02-18,000001,Vente en l'état futur d'achèvement,120500,,,BD DES CAPUCINES,0070,12850,12176,Onet-le-Château,12,,,12176000BE0539,,,61,,,,,,,,,,1,,,,,,,,,,2.597257,44.364154
2021-142436,2021-02-26,000001,Vente,343400,2,,LES COMBES,B090,12850,12176,Onet-le-Château,12,,,12176000AP0189,,,,,,,,,,,,,0,3,Dépendance,,0,S,sols,,,600,2.547827,44.386541
2021-142436,2021-02-26,000001,Vente,343400,2,,LES COMBES,B090,12850,12176,Onet-le-Château,12,,,12176000AP0189,,,,,,,,,,,,,0,1,Maison,130,7,S,sols,,,600,2.547827,44.386541
2021-142436,2021-02-26,000001,Vente,343400,2,,LES COMBES,B090,12850,12176,Onet-le-Château,12,,,12176000AP0189,,,,,,,,,,,,,0,3,Dépendance,,0,J,jardins,,,1682,2.547827,44.386541
2021-142436,2021-02-26,000001,Vente,343400,2,,LES COMBES,B090,12850,12176,Onet-le-Château,12,,,12176000AP0189,,,,,,,,,,,,,0,1,Maison,130,7,J,jardins,,,1682,2.547827,44.386541
2021-142436,2021-02-26,000001,Vente,343400,,,LES COMBES,B090,12850,12176,Onet-le-Château,12,,,12176000AP0191,,,,,,,,,,,,,0,,,,,T,terres,,,654,2.548389,44.386188
2021-142479,2021-02-22,000001,Vente,147867,27,,RUE DES TULIPES,0365,12850,12176,Onet-le-Château,12,,,12176000BX0171,,,,,,,,,,,,,0,1,Maison,86,5,S,sols,,,443,2.59503,44.362979
2021-142551,2021-02-17,000001,Vente,158310,325,,RUE DES PINS,0257,12850,12176,Onet-le-Château,12,,,12176000BC0525,,,1,,13,,42,68.42,,,,,3,3,Dépendance,,0,,,,,,2.58034,44.378157
2021-142551,2021-02-17,000001,Vente,158310,325,,RUE DES PINS,0257,12850,12176,Onet-le-Château,12,,,12176000BC0525,,,1,,13,,42,68.42,,,,,3,3,Dépendance,,0,,,,,,2.58034,44.378157
2021-142551,2021-02-17,000001,Vente,158310,325,,RUE DES PINS,0257,12850,12176,Onet-le-Château,12,,,12176000BC0525,,,1,,13,,42,68.42,,,,,3,2,Appartement,68,3,,,,,,2.58034,44.378157
2021-142552,2021-03-02,000001,Vente,185000,34,,RUE DES ERABLES,0113,12850,12176,Onet-le-Château,12,,,12176000BC0535,,,42,,45,88.59,,,,,,,2,3,Dépendance,,0,,,,,,2.581703,44.376564
2021-142552,2021-03-02,000001,Vente,185000,34,,RUE DES ERABLES,0113,12850,12176,Onet-le-Château,12,,,12176000BC0535,,,32,,,,,,,,,,1,3,Dépendance,,0,,,,,,2.581703,44.376564
2021-142552,2021-03-02,000001,Vente,185000,34,,RUE DES ERABLES,0113,12850,12176,Onet-le-Château,12,,,12176000BC0535,,,42,,45,88.59,,,,,,,2,2,Appartement,89,4,,,,,,2.581703,44.376564
2021-142600,2021-02-23,000001,Vente en l'état futur d'achèvement,183000,,,RUE DES PINS,0257,12850,12176,Onet-le-Château,12,,,12176000BC0525,,,100,,,,,,,,,,1,,,,,,,,,,2.58034,44.378157
2021-142600,2021-02-23,000001,Vente en l'état futur d'achèvement,183000,,,RUE DES PINS,0257,12850,12176,Onet-le-Château,12,,,12176000BC0525,,,54,,,,,,,,,,1,,,,,,,,,,2.58034,44.378157
2021-142600,2021-02-23,000001,Vente en l'état futur d'achèvement,183000,,,RUE DES PINS,0257,12850,12176,Onet-le-Château,12,,,12176000BC0525,,,85,,,,,,,,,,1,,,,,,,,,,2.58034,44.378157
2021-142603,2021-02-22,000001,Vente,161230,325,,RUE DES PINS,0257,12850,12176,Onet-le-Château,12,,,12176000BC0525,,,21,,38,66.06,,,,,,,2,3,Dépendance,,0,,,,,,2.58034,44.378157
2021-142603,2021-02-22,000001,Vente,161230,325,,RUE DES PINS,0257,12850,12176,Onet-le-Château,12,,,12176000BC0525,,,21,,38,66.06,,,,,,,2,2,Appartement,66,3,,,,,,2.58034,44.378157
2021-142607,2021-02-26,000001,Vente,240000,4,,IMP DES THERMES,0357,12850,12176,Onet-le-Château,12,,,12176000BD0245,,,,,,,,,,,,,0,1,Maison,101,5,J,jardins,,,265,2.574843,44.370232
2021-142607,2021-02-26,000001,Vente,240000,4,,IMP DES THERMES,0357,12850,12176,Onet-le-Château,12,,,12176000BD0245,,,,,,,,,,,,,0,1,Maison,101,5,S,sols,,,600,2.574843,44.370232
2021-142618,2021-03-03,000001,Vente,75730,,,LOBAU,B153,12850,12176,Onet-le-Château,12,,,12176000AC0010,,,,,,,,,,,,,0,,,,,P,prés,,,8290,2.484879,44.392992
2021-142656,2021-03-03,000001,Vente,187000,47,,RUE DES PELICANS,0254,12850,12176,Onet-le-Château,12,,,12176000AX0825,,,,,,,,,,,,,0,1,Maison,88,4,S,sols,,,245,2.573864,44.380109
2021-142707,2021-03-05,000001,Vente,88240,41,,RTE D ESPALION,0115,12850,12176,Onet-le-Château,12,,,12176000BD0732,,,30,,8,,,,,,,,2,3,Dépendance,,0,,,,,,2.586619,44.366845
2021-142707,2021-03-05,000001,Vente,88240,41,,RTE D ESPALION,0115,12850,12176,Onet-le-Château,12,,,12176000BD0732,,,15,,,,,,,,,,1,3,Dépendance,,0,,,,,,2.586619,44.366845
2021-142707,2021-03-05,000001,Vente,88240,41,,RTE D ESPALION,0115,12850,12176,Onet-le-Château,12,,,12176000BD0732,,,30,,8,,,,,,,,2,2,Appartement,50,2,,,,,,2.586619,44.366845
2021-142709,2021-03-05,000001,Vente,185000,6,,RUE DES JONQUILLES,0155,12850,12176,Onet-le-Château,12,,,12176000BW0072,,,,,,,,,,,,,0,1,Maison,122,8,S,sols,,,698,2.599563,44.362516
2021-142726,2021-02-26,000001,Vente,87800,20,,RTE DE SEVERAC,0345,12850,12176,Onet-le-Château,12,,,12176000BX0408,,,34,13.6,,,,,,,,,1,3,Dépendance,,0,,,,,,2.589107,44.363235
2021-142726,2021-02-26,000001,Vente,87800,20,,RTE DE SEVERAC,0345,12850,12176,Onet-le-Château,12,,,12176000BX0408,,,14,40.2,,,,,,,,,1,2,Appartement,40,2,,,,,,2.589107,44.363235
2021-142726,2021-02-26,000001,Vente,87800,20,,RTE DE SEVERAC,0345,12850,12176,Onet-le-Château,12,,,12176000BX0408,,,3,,,,,,,,,,1,3,Dépendance,,0,,,,,,2.589107,44.363235
2021-142769,2021-03-12,000001,Vente,280000,19,,RUE DES PLANQUETTES,0266,12850,12176,Onet-le-Château,12,,,12176000BY0401,,,,,,,,,,,,,0,1,Maison,84,3,S,sols,,,634,2.58336,44.36467
2021-142840,2021-03-17,000002,Vente,171,,,LES CARRIERES,B052,12850,12176,Onet-le-Château,12,,,12176000AS0278,,,,,,,,,,,,,0,,,,,AB,terrains a bâtir,,,171,2.559003,44.403454
2021-142849,2021-03-23,000001,Vente,173000,1,,BD DES CORMORANS,0097,12850,12176,Onet-le-Château,12,,,12176000AX0327,,,,,,,,,,,,,0,1,Maison,101,5,S,sols,,,359,2.569372,44.376539
2021-142862,2021-03-23,000001,Vente,333000,9,,RUE ALFRED DE MUSSET,0003,12850,12176,Onet-le-Château,12,,,12176000AW0274,,,,,,,,,,,,,0,1,Maison,130,5,S,sols,,,600,2.552787,44.373614