id_mutation,date_mutation,numero_disposition,nature_mutation,valeur_fonciere,adresse_numero,adresse_suffixe,adresse_nom_voie,adresse_code_voie,code_postal,code_commune,nom_commune,code_departement,ancien_code_commune,ancien_nom_commune,id_parcelle,ancien_id_parcelle,numero_volume,lot1_numero,lot1_surface_carrez,lot2_numero,lot2_surface_carrez,lot3_numero,lot3_surface_carrez,lot4_numero,lot4_surface_carrez,lot5_numero,lot5_surface_carrez,nombre_lots,code_type_local,type_local,surface_reelle_bati,nombre_pieces_principales,code_nature_culture,nature_culture,code_nature_culture_speciale,nature_culture_speciale,surface_terrain,longitude,latitude
2021-142303,2021-02-05,000001,Vente,58000,5047,,SAUCLIERES,B228,12230,12260,Sauclières,12,,,122600000E0079,,,,,,,,,,,,,0,1,Maison,60,4,S,sols,,,96,3.367352,43.976555
2021-142924,2021-03-24,000001,Vente,44000,,,LES GLARESQUES,B121,12230,12260,Sauclières,12,,,122600000C0002,,,,,,,,,,,,,0,,,,,BR,futaies résineuses,,,7010,3.397956,43.990635
2021-142924,2021-03-24,000001,Vente,44000,,,LES GLARESQUES,B121,12230,12260,Sauclières,12,,,122600000C0003,,,,,,,,,,,,,0,,,,,BR,futaies résineuses,,,23790,3.397524,43.989993
2021-142924,2021-03-24,000001,Vente,44000,,,LES GLARESQUES,B121,12230,12260,Sauclières,12,,,122600000C0009,,,,,,,,,,,,,0,,,,,BR,futaies résineuses,,,2830,3.396503,43.989675
2021-142953,2021-03-23,000001,Vente,45000,5076,,SAUCLIERES,B228,12230,12260,Sauclières,12,,,122600000E0090,,,,,,,,,,,,,0,1,Maison,130,7,S,sols,,,90,3.367082,43.976411
2021-142953,2021-03-23,000001,Vente,45000,,,SAUCLIERES,B228,12230,12260,Sauclières,12,,,122600000E0354,,,,,,,,,,,,,0,,,,,J,jardins,,,106,3.366309,43.976307
2021-143637,2021-04-13,000001,Vente,25000,5115,,LE GRESSENTIS,B126,12230,12260,Sauclières,12,,,122600000D0470,,,,,,,,,,,,,0,1,Maison,30,1,S,sols,,,129,3.388424,43.982939
2021-143637,2021-04-13,000001,Vente,25000,,,LE GRESSENTIS,B126,12230,12260,Sauclières,12,,,122600000D0471,,,,,,,,,,,,,0,,,,,L,landes,VAGUE,Terrain vague,240,3.388322,43.982881
2021-144883,2021-05-26,000001,Vente,57904,,,LA DEVEZE,B093,12230,12260,Sauclières,12,,,122600000F0042,,,,,,,,,,,,,0,,,,,L,landes,VAGUE,Terrain vague,620,3.356571,44.005377
2021-144883,2021-05-26,000001,Vente,57904,,,LA DEVEZE,B093,12230,12260,Sauclières,12,,,122600000F0043,,,,,,,,,,,,,0,,,,,VE,vergers,CHAT,Châtaigneraie,4850,3.358422,44.004918
2021-144883,2021-05-26,000001,Vente,57904,,,LA DEVEZE,B093,12230,12260,Sauclières,12,,,122600000F0047,,,,,,,,,,,,,0,,,,,VE,vergers,CHAT,Châtaigneraie,1960,3.360717,44.003816
2021-144883,2021-05-26,000001,Vente,57904,,,LA DEVEZE,B093,12230,12260,Sauclières,12,,,122600000F0050,,,,,,,,,,,,,0,,,,,VE,vergers,CHAT,Châtaigneraie,3940,3.361828,44.002683
2021-144883,2021-05-26,000001,Vente,57904,,,LA DEVEZE,B093,12230,12260,Sauclières,12,,,122600000F0051,,,,,,,,,,,,,0,,,,,VE,vergers,CHAT,Châtaigneraie,2830,3.362318,44.00177
2021-144883,2021-05-26,000001,Vente,57904,,,LA DEVEZE,B093,12230,12260,Sauclières,12,,,122600000F0059,,,,,,,,,,,,,0,,,,,VE,vergers,CHAT,Châtaigneraie,3810,3.360611,44.00289
2021-145269,2021-07-01,000001,Vente,1055,,,LES PRADALS,B179,12230,12260,Sauclières,12,,,122600000C0041,,,,,,,,,,,,,0,,,,,BR,futaies résineuses,,,3250,3.398531,43.986148
2021-145269,2021-07-01,000001,Vente,1055,,,LES PRADALS,B179,12230,12260,Sauclières,12,,,122600000C0042,,,,,,,,,,,,,0,,,,,BR,futaies résineuses,,,4000,3.398309,43.98691
2021-145269,2021-07-01,000001,Vente,1055,,,LES PRADALS,B179,12230,12260,Sauclières,12,,,122600000C0043,,,,,,,,,,,,,0,,,,,BR,futaies résineuses,,,1540,3.398209,43.987336
2021-147820,2021-10-01,000001,Vente,1800,,,SAUCLIERES,B228,12230,12260,Sauclières,12,,,122600000E0069,,,,,,,,,,,,,0,,,,,J,jardins,,,233,3.36784,43.977654
2021-148323,2021-10-27,000001,Vente,53200,5077,,SAUCLIERES,B228,12230,12260,Sauclières,12,,,122600000E0084,,,,,,,,,,,,,0,3,Dépendance,,0,S,sols,,,100,3.367272,43.976373
2021-148323,2021-10-27,000001,Vente,53200,5077,,SAUCLIERES,B228,12230,12260,Sauclières,12,,,122600000E0084,,,,,,,,,,,,,0,1,Maison,173,6,S,sols,,,100,3.367272,43.976373
2021-148323,2021-10-27,000001,Vente,53200,,,SAUCLIERES,B228,12230,12260,Sauclières,12,,,122600000E0085,,,,,,,,,,,,,0,,,,,S,sols,,,44,3.367141,43.976357
2021-148323,2021-10-27,000001,Vente,53200,,,SAUCLIERES,B228,12230,12260,Sauclières,12,,,122600000E0086,,,,,,,,,,,,,0,,,,,S,sols,,,48,3.367199,43.976423
2021-148886,2021-11-24,000001,Vente,2000,,,LES PRADALS,B179,12230,12260,Sauclières,12,,,122600000C0051,,,,,,,,,,,,,0,,,,,BR,futaies résineuses,,,9870,3.39635,43.98455
2021-148886,2021-11-24,000001,Vente,2000,,,LES PRADALS,B179,12230,12260,Sauclières,12,,,122600000C0055,,,,,,,,,,,,,0,,,,,BR,futaies résineuses,,,5780,3.394943,43.984474
2021-148886,2021-11-24,000001,Vente,2000,,,MONCAN,B151,12230,12260,Sauclières,12,,,122600000C0074,,,,,,,,,,,,,0,,,,,BR,futaies résineuses,,,3820,3.395491,43.982723
2021-149397,2021-12-14,000001,Vente,13290,,,LE LAUGIO,B135,12230,12260,Sauclières,12,,,122600000F0031,,,,,,,,,,,,,0,,,,,T,terres,,,4600,3.353473,44.007502
2021-149397,2021-12-14,000001,Vente,13290,,,LE LAUGIO,B135,12230,12260,Sauclières,12,,,122600000F0033,,,,,,,,,,,,,0,,,,,T,terres,,,4150,3.354648,44.00824
2021-149397,2021-12-14,000001,Vente,13290,,,LE LAUGIO,B135,12230,12260,Sauclières,12,,,122600000F0039,,,,,,,,,,,,,0,,,,,T,terres,,,5720,3.355912,44.006586
2021-149397,2021-12-14,000001,Vente,13290,,,LA DEVEZE,B093,12230,12260,Sauclières,12,,,122600000F0044,,,,,,,,,,,,,0,,,,,T,terres,,,2580,3.358911,44.005085
2021-149397,2021-12-14,000001,Vente,13290,,,LA DEVEZE,B093,12230,12260,Sauclières,12,,,122600000F0046,,,,,,,,,,,,,0,,,,,T,terres,,,10390,3.360094,44.004115
2021-149397,2021-12-14,000001,Vente,13290,,,LA DEVEZE,B093,12230,12260,Sauclières,12,,,122600000F0058,,,,,,,,,,,,,0,,,,,T,terres,,,4360,3.361259,44.002679
2021-149397,2021-12-14,000001,Vente,13290,,,LA DEVEZE,B093,12230,12260,Sauclières,12,,,122600000F0060,,,,,,,,,,,,,0,,,,,T,terres,,,5560,3.360056,44.002713
2021-149668,2021-12-21,000001,Vente,100000,5154,,SAUCLIERES,B228,12230,12260,Sauclières,12,,,122600000E0394,,,,,,,,,,,,,0,2,Appartement,82,4,S,sols,,,594,3.366398,43.975496
2021-149668,2021-12-21,000001,Vente,100000,5154,,SAUCLIERES,B228,12230,12260,Sauclières,12,,,122600000E0394,,,,,,,,,,,,,0,3,Dépendance,,0,S,sols,,,594,3.366398,43.975496
2021-149668,2021-12-21,000001,Vente,100000,5154,,SAUCLIERES,B228,12230,12260,Sauclières,12,,,122600000E0394,,,,,,,,,,,,,0,3,Dépendance,,0,S,sols,,,594,3.366398,43.975496
2021-149668,2021-12-21,000001,Vente,100000,5154,,SAUCLIERES,B228,12230,12260,Sauclières,12,,,122600000E0394,,,,,,,,,,,,,0,2,Appartement,83,4,S,sols,,,594,3.366398,43.975496
2021-150077,2021-12-22,000001,Vente,63130,5142,,SAUCLIERES,B228,12230,12260,Sauclières,12,,,122600000E0164,,,,,,,,,,,,,0,1,Maison,60,2,S,sols,,,51,3.366808,43.975883
