id_mutation,date_mutation,numero_disposition,nature_mutation,valeur_fonciere,adresse_numero,adresse_suffixe,adresse_nom_voie,adresse_code_voie,code_postal,code_commune,nom_commune,code_departement,ancien_code_commune,ancien_nom_commune,id_parcelle,ancien_id_parcelle,numero_volume,lot1_numero,lot1_surface_carrez,lot2_numero,lot2_surface_carrez,lot3_numero,lot3_surface_carrez,lot4_numero,lot4_surface_carrez,lot5_numero,lot5_surface_carrez,nombre_lots,code_type_local,type_local,surface_reelle_bati,nombre_pieces_principales,code_nature_culture,nature_culture,code_nature_culture_speciale,nature_culture_speciale,surface_terrain,longitude,latitude
2021-176895,2021-01-26,000001,Vente,230000,,,LA CADENIERE,B025,13350,13024,Charleval,13,,,13024000BM0174,,,,,,,,,,,,,0,,,,,T,terres,,,84,5.244892,43.717726
2021-176895,2021-01-26,000001,Vente,230000,,,LA CADENIERE,B025,13350,13024,Charleval,13,,,13024000BM0175,,,,,,,,,,,,,0,,,,,T,terres,,,37,5.245018,43.717728
2021-176895,2021-01-26,000001,Vente,230000,,,LA CADENIERE,B025,13350,13024,Charleval,13,,,13024000BM0178,,,,,,,,,,,,,0,,,,,T,terres,,,96,5.245262,43.717753
2021-176895,2021-01-26,000001,Vente,230000,,,LA CADENIERE,B025,13350,13024,Charleval,13,,,13024000BM0179,,,,,,,,,,,,,0,,,,,T,terres,,,142,5.245611,43.717827
2021-176895,2021-01-26,000001,Vente,230000,,,LA CADENIERE,B025,13350,13024,Charleval,13,,,13024000BM0184,,,,,,,,,,,,,0,,,,,T,terres,,,7,5.245006,43.717674
2021-176895,2021-01-26,000001,Vente,230000,,,LA CADENIERE,B025,13350,13024,Charleval,13,,,13024000BM0185,,,,,,,,,,,,,0,,,,,T,terres,,,28,5.244926,43.717645
2021-176895,2021-01-26,000001,Vente,230000,6,,AV DU BOIS,0507,13350,13024,Charleval,13,,,13024000BM0224,,,,,,,,,,,,,0,1,Maison,94,4,S,sols,,,858,5.245083,43.717619
2021-176933,2021-01-22,000001,Vente,200000,7,,RUE SAINT CEZAIRE,1012,13350,13024,Charleval,13,,,13024000AB0501,,,,,,,,,,,,,0,1,Maison,83,3,S,sols,,,61,5.244739,43.719963
2021-176934,2021-01-21,000001,Vente,258000,17,,RUE SAINTE THERESE,8000,13350,13024,Charleval,13,,,13024000AB0298,,,,,,,,,,,,,0,1,Maison,108,4,S,sols,,,121,5.244797,43.719205
2021-177298,2021-02-15,000001,Vente,260000,5256,,LA CADENIERE,B025,13350,13024,Charleval,13,,,13024000BM0064,,,,,,,,,,,,,0,1,Maison,67,3,S,sols,,,306,5.245854,43.717443
2021-177298,2021-02-15,000001,Vente,260000,5256,,LA CADENIERE,B025,13350,13024,Charleval,13,,,13024000BM0064,,,,,,,,,,,,,0,1,Maison,67,3,AG,terrains d'agrément,,,589,5.245854,43.717443
2021-177407,2021-01-27,000001,Vente,280000,5001,,RUE DE LA BALLASTRIERE,0500,13350,13024,Charleval,13,,,13024000BN0277,,,,,,,,,,,,,0,1,Maison,83,3,S,sols,,,1157,5.242331,43.715095
2021-177407,2021-01-27,000001,Vente,280000,5001,,RUE DE LA BALLASTRIERE,0500,13350,13024,Charleval,13,,,13024000BN0277,,,,,,,,,,,,,0,3,Dépendance,,0,S,sols,,,1157,5.242331,43.715095
2021-177448,2021-01-28,000001,Vente,120000,70,,RUE TUILERIE,8510,13350,13024,Charleval,13,,,13024000AB0545,,,8,,,,,,,,,,1,3,Dépendance,,0,,,,,,5.242132,43.720084
2021-177448,2021-01-28,000001,Vente,120000,70,,RUE TUILERIE,8510,13350,13024,Charleval,13,,,13024000AB0545,,,5,,,,,,,,,,1,2,Appartement,94,4,,,,,,5.242132,43.720084
2021-177814,2021-03-03,000001,Vente,850000,,,LA CADENIERE,B025,13350,13024,Charleval,13,,,13024000BM0070,,,,,,,,,,,,,0,,,,,T,terres,,,145,5.24429,43.717972
2021-177814,2021-03-03,000001,Vente,850000,,,LA CADENIERE,B025,13350,13024,Charleval,13,,,13024000BM0072,,,,,,,,,,,,,0,,,,,T,terres,,,102,5.244263,43.718078
2021-177814,2021-03-03,000001,Vente,850000,29,,BD DE LA DURANCE,1700,13350,13024,Charleval,13,,,13024000BM0117,,,,,,,,,,,,,0,3,Dépendance,,0,S,sols,,,2920,5.244192,43.717644
2021-177814,2021-03-03,000001,Vente,850000,29,,BD DE LA DURANCE,1700,13350,13024,Charleval,13,,,13024000BM0117,,,,,,,,,,,,,0,1,Maison,203,6,S,sols,,,2920,5.244192,43.717644
2021-178024,2021-02-26,000001,Vente,230000,42,,RUE TUILERIE,8510,13350,13024,Charleval,13,,,13024000AB0026,,,,,,,,,,,,,0,1,Maison,100,3,S,sols,,,72,5.24354,43.720339
2021-178074,2021-03-12,000001,Vente,9800.8,,,LA PRADELLE,B068,13350,13024,Charleval,13,,,13024000AT0047,,,,,,,,,,,,,0,,,,,T,terres,,,5694,5.239844,43.741261
2021-178074,2021-03-12,000001,Vente,9800.8,,,LA PRADELLE,B068,13350,13024,Charleval,13,,,13024000AT0092,,,,,,,,,,,,,0,,,,,T,terres,,,6557,5.24032,43.741708
2021-178078,2021-03-22,000001,Vente,285000,5091,,LES CHAFFARDS,B028,13350,13024,Charleval,13,,,13024000AE0046,,,,,,,,,,,,,0,1,Maison,130,5,S,sols,,,696,5.240561,43.723734
2021-178078,2021-03-22,000001,Vente,285000,,,LES CHAFFARDS,B028,13350,13024,Charleval,13,,,13024000AE0049,,,,,,,,,,,,,0,,,,,J,jardins,POTAG,Jardin potager,903,5.240101,43.723879
2021-178217,2021-03-19,000001,Vente,255000,101,,BD DE LA DURANCE,1700,13350,13024,Charleval,13,,,13024000BK0111,,,50,,,,,,,,,,1,2,Appartement,78,3,,,,,,5.255557,43.718831
2021-178217,2021-03-19,000001,Vente,255000,101,,BD DE LA DURANCE,1700,13350,13024,Charleval,13,,,13024000BK0111,,,51,,,,,,,,,,1,3,Dépendance,,0,,,,,,5.255557,43.718831
2021-178217,2021-03-19,000001,Vente,255000,101,,BD DE LA DURANCE,1700,13350,13024,Charleval,13,,,13024000BK0111,,,51,,,,,,,,,,1,3,Dépendance,,0,,,,,,5.255557,43.718831
2021-178245,2021-02-16,000001,Vente,260000,101,,BD DE LA DURANCE,1700,13350,13024,Charleval,13,,,13024000BK0111,,,86,,,,,,,,,,1,3,Dépendance,,0,,,,,,5.255557,43.718831
2021-178245,2021-02-16,000001,Vente,260000,101,,BD DE LA DURANCE,1700,13350,13024,Charleval,13,,,13024000BK0111,,,86,,,,,,,,,,1,3,Dépendance,,0,,,,,,5.255557,43.718831
2021-178245,2021-02-16,000001,Vente,260000,101,,BD DE LA DURANCE,1700,13350,13024,Charleval,13,,,13024000BK0111,,,85,78.02,,,,,,,,,1,2,Appartement,78,3,,,,,,5.255557,43.718831
2021-178495,2021-03-15,000001,Vente,245150,101,,BD DE LA DURANCE,1700,13350,13024,Charleval,13,,,13024000BK0111,,,112,,,,,,,,,,1,3,Dépendance,,0,,,,,,5.255557,43.718831
2021-178495,2021-03-15,000001,Vente,245150,101,,BD DE LA DURANCE,1700,13350,13024,Charleval,13,,,13024000BK0111,,,27,65.31,,,,,,,,,1,2,Appartement,65,3,,,,,,5.255557,43.718831
2021-178495,2021-03-15,000001,Vente,245150,101,,BD DE LA DURANCE,1700,13350,13024,Charleval,13,,,13024000BK0111,,,39,,,,,,,,,,1,3,Dépendance,,0,,,,,,5.255557,43.718831
2021-178555,2021-03-19,000001,Vente,265000,101,,BD DE LA DURANCE,1700,13350,13024,Charleval,13,,,13024000BK0111,,,70,77.52,,,,,,,,,1,2,Appartement,78,3,,,,,,5.255557,43.718831
2021-178555,2021-03-19,000001,Vente,265000,101,,BD DE LA DURANCE,1700,13350,13024,Charleval,13,,,13024000BK0111,,,129,,,,,,,,,,1,3,Dépendance,,0,,,,,,5.255557,43.718831
2021-179045,2021-04-16,000001,Vente,327000,5267,,LA CADENIERE,B025,13350,13024,Charleval,13,,,13024000BM0089,,,,,,,,,,,,,0,1,Maison,83,3,S,sols,,,920,5.242866,43.716994
2021-179045,2021-04-16,000001,Vente,327000,5267,,LA CADENIERE,B025,13350,13024,Charleval,13,,,13024000BM0089,,,,,,,,,,,,,0,3,Dépendance,,0,S,sols,,,920,5.242866,43.716994
2021-179730,2021-05-11,000001,Echange,152000,,,LES ESCOURCHES,B040,13350,13024,Charleval,13,,,13024000BL0129,,,,,,,,,,,,,0,,,,,T,terres,,,476,5.247598,43.719096
2021-179730,2021-05-11,000001,Echange,152000,5209,,BD DE LA DURANCE,1700,13350,13024,Charleval,13,,,13024000BL0131,,,,,,,,,,,,,0,1,Maison,120,5,S,sols,,,1155,5.247828,43.719061
2021-179730,2021-05-11,000001,Echange,152000,5209,,BD DE LA DURANCE,1700,13350,13024,Charleval,13,,,13024000BL0131,,,,,,,,,,,,,0,1,Maison,120,5,S,sols,,,169,5.247828,43.719061
2021-179731,2021-05-11,000002,Echange,48000,,,LES ESCOURCHES,B040,13350,13024,Charleval,13,,,13024000BL0129,,,,,,,,,,,,,0,,,,,T,terres,,,476,5.247598,43.719096
2021-179731,2021-05-11,000002,Echange,48000,5209,,BD DE LA DURANCE,1700,13350,13024,Charleval,13,,,13024000BL0131,,,,,,,,,,,,,0,1,Maison,120,5,S,sols,,,169,5.247828,43.719061
2021-179731,2021-05-11,000002,Echange,48000,5209,,BD DE LA DURANCE,1700,13350,13024,Charleval,13,,,13024000BL0131,,,,,,,,,,,,,0,1,Maison,120,5,S,sols,,,1155,5.247828,43.719061
2021-179763,2021-05-04,000001,Vente,135000,10,,RUE TUILERIE,8510,13350,13024,Charleval,13,,,13024000AB0533,,,,,,,,,,,,,0,2,Appartement,55,3,S,sols,,,32,5.245303,43.720689
2021-179763,2021-05-04,000001,Vente,135000,10,,RUE TUILERIE,8510,13350,13024,Charleval,13,,,13024000AB0534,,,1,,,,,,,,,,1,3,Dépendance,,0,,,,,,5.245278,43.720759
2021-179832,2021-05-20,000001,Vente,269455,19,,AV GASTON ROUX,4700,13350,13024,Charleval,13,,,13024000AB0247,,,,,,,,,,,,,0,1,Maison,90,3,S,sols,,,91,5.245493,43.719512
2021-179893,2021-05-11,000001,Vente,204000,32,,BD DE LA DURANCE,1700,13350,13024,Charleval,13,,,13024000BN0328,,,1,,,,,,,,,,1,2,Appartement,72,3,,,,,,5.238329,43.717471
2021-179908,2021-05-20,000001,Vente,208800,10,,RUE SAINT JOSEPH,8050,13350,13024,Charleval,13,,,13024000AB0487,,,,,,,,,,,,,0,1,Maison,70,3,S,sols,,,95,5.246225,43.720675
2021-180165,2021-05-31,000001,Vente,12500,9256,,RTE NATIONALE,5749,13350,13024,Charleval,13,,,13024000AB0256,,,1,,,,,,,,,,1,3,Dépendance,,0,,,,,,5.244446,43.719511
2021-180574,2021-06-15,000001,Vente,180000,12,,AV GASTON ROUX,4700,13350,13024,Charleval,13,,,13024000AB0508,,,,,,,,,,,,,0,2,Appartement,90,3,S,sols,,,50,5.245777,43.71976
2021-180577,2021-06-18,000001,Vente,1917,,,LES ROYERES,B076,13350,13024,Charleval,13,,,13024000AS0008,,,,,,,,,,,,,0,,,,,T,terres,,,1917,5.246701,43.738271
2021-181479,2021-06-29,000002,Vente,6840,5301,,BD DE LA DURANCE,1700,13350,13024,Charleval,13,,,13024000BL0728,,,,,,,,,,,,,0,,,,,S,sols,,,184,5.249825,43.71837
2021-181539,2021-07-12,000001,Vente,290330,9,,RUE DES AMANDIERS,0155,13350,13024,Charleval,13,,,13024000BL0627,,,,,,,,,,,,,0,1,Maison,88,4,S,sols,,,440,5.248892,43.717857
2021-181705,2021-07-13,000001,Vente,292000,5,,RUE DE LA BALLASTRIERE,0500,13350,13024,Charleval,13,,,13024000BM0192,,,,,,,,,,,,,0,1,Maison,73,4,S,sols,,,691,5.241709,43.717251
2021-181705,2021-07-13,000001,Vente,292000,,,BD DE LA DURANCE,1700,13350,13024,Charleval,13,,,13024000BM0195,,,,,,,,,,,,,0,,,,,S,sols,,,272,5.241382,43.71727
2021-182350,2021-07-12,000001,Vente,415950,5322,,RES LA BALLASTRIERE,A002,13350,13024,Charleval,13,,,13024000BN0322,,,,,,,,,,,,,0,1,Maison,137,6,S,sols,,,1223,5.241514,43.715006
2021-182589,2021-06-17,000001,Vente,175000,,,LES ESCOURCHES,B040,13350,13024,Charleval,13,,,13024000BL0721,,,,,,,,,,,,,0,,,,,AB,terrains a bâtir,,,213,5.250778,43.717769
2021-182589,2021-06-17,000001,Vente,175000,,,LES ESCOURCHES,B040,13350,13024,Charleval,13,,,13024000BL0723,,,,,,,,,,,,,0,,,,,AB,terrains a bâtir,,,543,5.250725,43.717975
2021-182658,2021-08-06,000002,Vente,2250,,,LES ESCOURCHES,B040,13350,13024,Charleval,13,,,13024000BL0729,,,,,,,,,,,,,0,,,,,AB,terrains a bâtir,,,25,5.250617,43.716033
2021-182899,2021-08-09,000001,Vente,184100,1,,AV GASTON ROUX,4700,13350,13024,Charleval,13,,,13024000AB0418,,,,,,,,,,,,,0,1,Maison,67,2,S,sols,,,62,5.246455,43.719639
2021-183078,2021-08-31,000001,Vente,291700,14,,RUE SAINTE THERESE,8000,13350,13024,Charleval,13,,,13024000AB0269,,,,,,,,,,,,,0,1,Maison,80,4,S,sols,,,189,5.243458,43.719386
2021-183512,2021-09-09,000002,Vente,270000,5151,,LES VERGERS,B095,13350,13024,Charleval,13,,,13024000BE0319,,,,,,,,,,,,,0,1,Maison,44,3,S,sols,,,601,5.249065,43.720949
2021-183512,2021-09-09,000002,Vente,270000,5151,,LES VERGERS,B095,13350,13024,Charleval,13,,,13024000BE0319,,,,,,,,,,,,,0,1,Maison,74,3,S,sols,,,601,5.249065,43.720949
2021-183534,2021-08-30,000001,Vente,220000,5166,,LES VERGERS,B095,13350,13024,Charleval,13,,,13024000BE0138,,,,,,,,,,,,,0,3,Dépendance,,0,S,sols,,,628,5.251755,43.720143
2021-183534,2021-08-30,000001,Vente,220000,5166,,LES VERGERS,B095,13350,13024,Charleval,13,,,13024000BE0138,,,,,,,,,,,,,0,1,Maison,65,4,S,sols,,,628,5.251755,43.720143
2021-183917,2021-09-09,000001,Vente,179000,101,,BD DE LA DURANCE,1700,13350,13024,Charleval,13,,,13024000BK0111,,,126,,,,,,,,,,1,3,Dépendance,,0,,,,,,5.255557,43.718831
2021-183917,2021-09-09,000001,Vente,179000,101,,BD DE LA DURANCE,1700,13350,13024,Charleval,13,,,13024000BK0111,,,68,,,,,,,,,,1,2,Appartement,51,2,,,,,,5.255557,43.718831
2021-184140,2021-09-23,000001,Vente,315000,5356,,LES VERGERS,B095,13350,13024,Charleval,13,,,13024000BE0223,,,,,,,,,,,,,0,1,Maison,62,3,S,sols,,,1008,5.253122,43.721289
2021-184176,2021-09-17,000001,Vente,210000,101,,BD DE LA DURANCE,1700,13350,13024,Charleval,13,,,13024000BK0111,,,136,,,,,,,,,,1,3,Dépendance,,0,,,,,,5.255557,43.718831
2021-184176,2021-09-17,000001,Vente,210000,101,,BD DE LA DURANCE,1700,13350,13024,Charleval,13,,,13024000BK0111,,,21,65.39,,,,,,,,,1,2,Appartement,65,3,,,,,,5.255557,43.718831
2021-184263,2021-10-12,000001,Vente,227000,1,,AV LOUIS CHARMET,4850,13350,13024,Charleval,13,,,13024000AB0304,,,,,,,,,,,,,0,1,Maison,90,4,S,sols,,,123,5.24541,43.719257
2021-184319,2021-10-13,000001,Vente,292000,33,,AV GASTON ROUX,4700,13350,13024,Charleval,13,,,13024000AB0258,,,,,,,,,,,,,0,1,Maison,110,3,S,sols,,,106,5.244255,43.719406
2021-184951,2021-10-26,000001,Vente,4350,,,L ARENAS,B003,13350,13024,Charleval,13,,,13024000AZ0023,,,,,,,,,,,,,0,,,,,T,terres,,,7854,5.253942,43.728905
2021-184951,2021-10-26,000001,Vente,4350,,,L ARENAS,B003,13350,13024,Charleval,13,,,13024000AZ0024,,,,,,,,,,,,,0,,,,,T,terres,,,4996,5.253549,43.728897
2021-184951,2021-10-26,000001,Vente,4350,,,L ARENAS,B003,13350,13024,Charleval,13,,,13024000AZ0025,,,,,,,,,,,,,0,,,,,T,terres,,,2421,5.253326,43.728892
2021-184951,2021-10-26,000001,Vente,4350,,,L ARENAS,B003,13350,13024,Charleval,13,,,13024000AZ0026,,,,,,,,,,,,,0,,,,,T,terres,,,3662,5.253116,43.728886
2021-184983,2021-11-05,000001,Vente,275000,5087,,LE PARC,B064,13350,13024,Charleval,13,,,13024000AC0103,,,,,,,,,,,,,0,1,Maison,90,5,S,sols,,,690,5.249462,43.722432
2021-184983,2021-11-05,000001,Vente,275000,5087,,LE PARC,B064,13350,13024,Charleval,13,,,13024000AC0103,,,,,,,,,,,,,0,3,Dépendance,,0,S,sols,,,690,5.249462,43.722432
2021-185474,2021-11-29,000001,Vente,550,,,LE COLOMBIER-NORD,B031,13350,13024,Charleval,13,,,13024000AW0055,,,,,,,,,,,,,0,,,,,T,terres,,,563,5.253602,43.739177
2021-185486,2021-11-10,000001,Vente,893000,,,SAINTE-CROIX,B083,13350,13024,Charleval,13,,,13024000BD0001,,,,,,,,,,,,,0,,,,,VE,vergers,,,20470,5.255194,43.727065
2021-185486,2021-11-10,000001,Vente,893000,,,SAINTE-CROIX,B083,13350,13024,Charleval,13,,,13024000BD0002,,,,,,,,,,,,,0,,,,,VE,vergers,,,16345,5.25551,43.724189
2021-185486,2021-11-10,000001,Vente,893000,,,SAINTE-CROIX,B083,13350,13024,Charleval,13,,,13024000BD0003,,,,,,,,,,,,,0,,,,,T,terres,,,905,5.25514,43.723767
2021-185486,2021-11-10,000001,Vente,893000,9004,,CHE DU COLOMBIER,1030,13350,13024,Charleval,13,,,13024000BD0004,,,,,,,,,,,,,0,2,Appartement,65,3,S,sols,,,2875,5.255377,43.723734
2021-185486,2021-11-10,000001,Vente,893000,9004,,CHE DU COLOMBIER,1030,13350,13024,Charleval,13,,,13024000BD0004,,,,,,,,,,,,,0,2,Appartement,85,3,S,sols,,,2875,5.255377,43.723734
2021-185486,2021-11-10,000001,Vente,893000,9004,,CHE DU COLOMBIER,1030,13350,13024,Charleval,13,,,13024000BD0004,,,,,,,,,,,,,0,3,Dépendance,,0,S,sols,,,2875,5.255377,43.723734
2021-185486,2021-11-10,000001,Vente,893000,9004,,CHE DU COLOMBIER,1030,13350,13024,Charleval,13,,,13024000BD0004,,,,,,,,,,,,,0,2,Appartement,113,3,S,sols,,,2875,5.255377,43.723734
2021-185486,2021-11-10,000001,Vente,893000,9004,,CHE DU COLOMBIER,1030,13350,13024,Charleval,13,,,13024000BD0004,,,,,,,,,,,,,0,2,Appartement,85,3,S,sols,,,2875,5.255377,43.723734
2021-185486,2021-11-10,000001,Vente,893000,,,SAINTE-CROIX,B083,13350,13024,Charleval,13,,,13024000BD0005,,,,,,,,,,,,,0,,,,,T,terres,,,1133,5.256216,43.723576
2021-185486,2021-11-10,000001,Vente,893000,,,SAINTE-CROIX,B083,13350,13024,Charleval,13,,,13024000BD0006,,,,,,,,,,,,,0,,,,,T,terres,,,9859,5.255855,43.723082
2021-185486,2021-11-10,000001,Vente,893000,,,SAINTE-CROIX,B083,13350,13024,Charleval,13,,,13024000BD0007,,,,,,,,,,,,,0,,,,,VE,vergers,,,5786,5.255309,43.721925
2021-185486,2021-11-10,000001,Vente,893000,,,SAINTE-CROIX,B083,13350,13024,Charleval,13,,,13024000BD0007,,,,,,,,,,,,,0,,,,,T,terres,,,5348,5.255309,43.721925
2021-185486,2021-11-10,000001,Vente,893000,,,SAINTE-CROIX,B083,13350,13024,Charleval,13,,,13024000BD0008,,,,,,,,,,,,,0,,,,,T,terres,,,7155,5.256242,43.722068
2021-185486,2021-11-10,000001,Vente,893000,,,SAINTE-CROIX,B083,13350,13024,Charleval,13,,,13024000BD0009,,,,,,,,,,,,,0,,,,,VE,vergers,,,1217,5.256613,43.721763
2021-185486,2021-11-10,000001,Vente,893000,,,LES HAUTS PONTS DE REYNAUD,B047,13350,13024,Charleval,13,,,13024000BE0081,,,,,,,,,,,,,0,,,,,VE,vergers,,,2518,5.254661,43.723461
2021-185553,2021-11-22,000001,Vente,185600,32,,BD DE LA DURANCE,1700,13350,13024,Charleval,13,,,13024000BN0328,,,5,50.44,,,,,,,,,1,2,Appartement,57,2,,,,,,5.238329,43.717471
2021-185553,2021-11-22,000001,Vente,185600,32,,BD DE LA DURANCE,1700,13350,13024,Charleval,13,,,13024000BN0328,,,7,,,,,,,,,,1,2,Appartement,72,3,,,,,,5.238329,43.717471
2021-186060,2021-12-20,000001,Vente,301550,23,,AV DES ALPILLES,0101,13350,13024,Charleval,13,,,13024000BN0493,,,,,,,,,,,,,0,4,Local industriel. commercial ou assimilé,160,0,S,sols,,,1221,5.236255,43.717955
2021-186060,2021-12-20,000001,Vente,301550,23,,AV DES ALPILLES,0101,13350,13024,Charleval,13,,,13024000BN0493,,,,,,,,,,,,,0,4,Local industriel. commercial ou assimilé,410,0,S,sols,,,1221,5.236255,43.717955
2021-186163,2021-12-17,000001,Vente,425000,5253,,LA CADENIERE,B025,13350,13024,Charleval,13,,,13024000BM0300,,,,,,,,,,,,,0,1,Maison,143,4,S,sols,,,705,5.242257,43.716086
2021-186163,2021-12-17,000001,Vente,425000,,,LA CADENIERE,B025,13350,13024,Charleval,13,,,13024000BM0301,,,,,,,,,,,,,0,,,,,S,sols,,,150,5.24191,43.716061
