id_mutation,date_mutation,numero_disposition,nature_mutation,valeur_fonciere,adresse_numero,adresse_suffixe,adresse_nom_voie,adresse_code_voie,code_postal,code_commune,nom_commune,code_departement,ancien_code_commune,ancien_nom_commune,id_parcelle,ancien_id_parcelle,numero_volume,lot1_numero,lot1_surface_carrez,lot2_numero,lot2_surface_carrez,lot3_numero,lot3_surface_carrez,lot4_numero,lot4_surface_carrez,lot5_numero,lot5_surface_carrez,nombre_lots,code_type_local,type_local,surface_reelle_bati,nombre_pieces_principales,code_nature_culture,nature_culture,code_nature_culture_speciale,nature_culture_speciale,surface_terrain,longitude,latitude
2021-176502,2021-01-05,000001,Vente,445100,9005,,VELINE,B065,13120,13041,Gardanne,13,,,13041000BI0190,,,,,,,,,,,,,0,1,Maison,140,8,S,sols,,,907,5.484789,43.448361
2021-176520,2021-01-14,000001,Vente,238500,9059,,IMP SANTA BARBARA,1047,13120,13041,Gardanne,13,,,13041000AK0059,,,170,,,,,,,,,,1,3,Dépendance,,0,,,,,,5.477403,43.462628
2021-176520,2021-01-14,000001,Vente,238500,9059,,IMP SANTA BARBARA,1047,13120,13041,Gardanne,13,,,13041000AK0059,,,124,,,,,,,,,,1,2,Appartement,56,3,,,,,,5.477403,43.462628
2021-176520,2021-01-14,000001,Vente,238500,9059,,IMP SANTA BARBARA,1047,13120,13041,Gardanne,13,,,13041000AK0059,,,171,,,,,,,,,,1,3,Dépendance,,0,,,,,,5.477403,43.462628
2021-176525,2021-01-06,000001,Vente en l'état futur d'achèvement,357000,,,FONT DE GARACH,B022,13120,13041,Gardanne,13,,,13041000BK0273,,,,,,,,,,,,,0,,,,,AB,terrains a bâtir,,,342,5.485549,43.445622
2021-176560,2021-01-08,000001,Vente,60000,4,,RUE LEDRU ROLLIN,0690,13120,13041,Gardanne,13,,,13041000BB0354,,,3,,6,,,,,,,,2,2,Appartement,28,2,,,,,,5.47053,43.456112
2021-176578,2021-01-05,000001,Vente,42000,501,,CHE DU SAFRAN,1035,13120,13041,Gardanne,13,,,13041000AI0014,,,5,,,,,,,,,,1,3,Dépendance,,0,,,,,,5.471572,43.463353
2021-176592,2021-01-12,000001,Vente,140000,9001,,RES LE GAUGUIN,A310,13120,13041,Gardanne,13,,,13041000BH0002,,,26,,36,,,,,,,,2,2,Appartement,76,4,,,,,,5.474907,43.45349
2021-176632,2021-01-13,000001,Vente,211000,9001,,RES L ASTRAL,A003,13120,13041,Gardanne,13,,,13041000AV0061,,,12,,,,,,,,,,1,3,Dépendance,,0,,,,,,5.480445,43.457466
2021-176632,2021-01-13,000001,Vente,211000,9001,,RES L ASTRAL,A003,13120,13041,Gardanne,13,,,13041000AV0061,,,18,,2,,,,,,,,2,2,Appartement,76,4,,,,,,5.480445,43.457466
2021-176657,2021-01-15,000001,Vente,127608,9001,,RES LA CRAU,A033,13120,13041,Gardanne,13,,,13041000AT0049,,,53,,,,,,,,,,1,3,Dépendance,,0,,,,,,5.480897,43.455597
2021-176657,2021-01-15,000001,Vente,127608,9001,,RES LA CRAU,A033,13120,13041,Gardanne,13,,,13041000AT0049,,,9,65.9,,,,,,,,,1,2,Appartement,60,3,,,,,,5.480897,43.455597
2021-176671,2021-01-20,000001,Vente,701650,,,ROMAN,B052,13120,13041,Gardanne,13,,,130410000A0117,,,,,,,,,,,,,0,,,,,BT,taillis simples,,,790,5.474946,43.488141
2021-176671,2021-01-20,000001,Vente,701650,,,ROMAN,B052,13120,13041,Gardanne,13,,,130410000A0119,,,,,,,,,,,,,0,,,,,S,sols,,,16,5.4757,43.487482
2021-176671,2021-01-20,000001,Vente,701650,,,ROMAN,B052,13120,13041,Gardanne,13,,,130410000A2027,,,,,,,,,,,,,0,,,,,AB,terrains a bâtir,,,1197,5.475407,43.487267
2021-176671,2021-01-20,000001,Vente,701650,9028,,ROMAN,B052,13120,13041,Gardanne,13,,,130410000A2028,,,,,,,,,,,,,0,1,Maison,160,6,T,terres,,,7060,5.475658,43.487599
2021-176671,2021-01-20,000001,Vente,701650,9028,,ROMAN,B052,13120,13041,Gardanne,13,,,130410000A2028,,,,,,,,,,,,,0,1,Maison,160,6,S,sols,,,937,5.475658,43.487599
2021-176707,2021-01-22,000001,Vente,165000,9001,,RES CAPTIVEL,A017,13120,13041,Gardanne,13,,,13041000AX0030,,,24,61.73,54,,,,,,,,2,2,Appartement,66,4,,,,,,5.47152,43.456912
2021-176715,2021-01-22,000001,Vente,130000,4,,AV DE LA LIBERATION,0700,13120,13041,Gardanne,13,,,13041000AX0052,,,4,,,,,,,,,,1,2,Appartement,50,2,,,,,,5.472292,43.457038
2021-176715,2021-01-22,000001,Vente,130000,4,,AV DE LA LIBERATION,0700,13120,13041,Gardanne,13,,,13041000AX0052,,,9,49.45,,,,,,,,,1,2,Appartement,50,2,,,,,,5.472292,43.457038
2021-176739,2021-01-21,000002,Vente,265000,,,LES MOLX,B034,13120,13041,Gardanne,13,,,13041000CE0103,,,,,,,,,,,,,0,,,,,L,landes,,,1845,5.460346,43.442299
2021-176739,2021-01-21,000002,Vente,265000,,,LES MOLX,B034,13120,13041,Gardanne,13,,,13041000CE0349,,,,,,,,,,,,,0,,,,,S,sols,,,907,5.459982,43.442753
2021-176789,2021-01-08,000001,Vente,205000,988,,RTE BLANCHE,0298,13120,13041,Gardanne,13,,,13041000BW0239,,,27,,,,,,,,,,1,3,Dépendance,,0,,,,,,5.470744,43.442702
2021-176789,2021-01-08,000001,Vente,205000,988,,RTE BLANCHE,0298,13120,13041,Gardanne,13,,,13041000BW0239,,,72,,,,,,,,,,1,2,Appartement,57,3,,,,,,5.470744,43.442702
2021-176789,2021-01-08,000001,Vente,205000,988,,RTE BLANCHE,0298,13120,13041,Gardanne,13,,,13041000BW0239,,,28,,,,,,,,,,1,3,Dépendance,,0,,,,,,5.470744,43.442702
2021-176791,2021-01-22,000001,Vente,373000,2,A,AV JEAN MOULIN,0658,13120,13041,Gardanne,13,,,13041000AW0141,,,,,,,,,,,,,0,1,Maison,100,4,S,sols,,,374,5.475692,43.458401
2021-176945,2021-01-14,000001,Vente,138000,,,RUE HOCHE,0630,13120,13041,Gardanne,13,,,13041000AZ0235,,,,,,,,,,,,,0,,,,,AB,terrains a bâtir,,,307,5.465669,43.456504
2021-176957,2021-01-27,000001,Vente en l'état futur d'achèvement,255000,,,LE PESQUIER SUD,B095,13120,13041,Gardanne,13,,,13041000BW0238,,,113,,,,,,,,,,1,,,,,,,,,,5.470909,43.443044
2021-176957,2021-01-27,000001,Vente en l'état futur d'achèvement,255000,,,LE PESQUIER SUD,B095,13120,13041,Gardanne,13,,,13041000BW0238,,,9,,,,,,,,,,1,,,,,,,,,,5.470909,43.443044
2021-176988,2021-02-01,000001,Vente,169800,210,,AV DU PILON DU ROY,0895,13120,13041,Gardanne,13,,,13041000CB0078,,,73,,,,,,,,,,1,3,Dépendance,,0,,,,,,5.466342,43.432189
2021-176988,2021-02-01,000001,Vente,169800,210,,AV DU PILON DU ROY,0895,13120,13041,Gardanne,13,,,13041000CB0078,,,62,47.36,,,,,,,,,1,2,Appartement,47,2,,,,,,5.466342,43.432189
2021-177042,2021-02-02,000001,Vente,390000,9035,,PAYANNET,B042,13120,13041,Gardanne,13,,,13041000AB0011,,,,,,,,,,,,,0,1,Maison,75,3,S,sols,,,2693,5.476141,43.474714
2021-177064,2021-02-04,000001,Vente,137989.6,9126,,RTE DES MOLX,0812,13120,13041,Gardanne,13,,,13041000BV0126,,,1,,,,,,,,,,1,1,Maison,98,4,S,sols,,,435,5.461474,43.441339
2021-177132,2021-01-15,000001,Vente,130000,3,,RUE VIALA,1170,13120,13041,Gardanne,13,,,13041000BB0165,,,,,,,,,,,,,0,2,Appartement,30,1,S,sols,,,34,5.469727,43.454657
2021-177132,2021-01-15,000001,Vente,130000,3,,RUE VIALA,1170,13120,13041,Gardanne,13,,,13041000BB0165,,,,,,,,,,,,,0,2,Appartement,40,2,S,sols,,,34,5.469727,43.454657
2021-177138,2021-02-04,000001,Vente,260000,,,VELINE,B065,13120,13041,Gardanne,13,,,13041000BI0009,,,74,,,,,,,,,,1,,,,,S,sols,,,73,5.483365,43.452044
2021-177138,2021-02-04,000001,Vente,260000,9001,,LOT LES HAMEAUX DE GARDANNE,A208,13120,13041,Gardanne,13,,,13041000BI0009,,,75,,,,,,,,,,1,1,Maison,58,3,S,sols,,,14,5.483365,43.452044
2021-177138,2021-02-04,000001,Vente,260000,9001,,LOT LES HAMEAUX DE GARDANNE,A208,13120,13041,Gardanne,13,,,13041000BI0009,,,73,,,,,,,,,,1,1,Maison,58,3,S,sols,,,102,5.483365,43.452044
2021-177167,2021-02-08,000001,Vente,280000,9,,LOT LA CRAU,A056,13120,13041,Gardanne,13,,,13041000AW0080,,,,,,,,,,,,,0,1,Maison,92,5,S,sols,,,531,5.476708,43.457306
2021-177170,2021-02-08,000001,Vente,4000,,,LE COUSTA,B018,13120,13041,Gardanne,13,,,13041000CP0254,,,,,,,,,,,,,0,,,,,AB,terrains a bâtir,,,11,5.459477,43.457032
2021-177173,2021-02-08,000001,Vente,240000,44,,PAS DE NORIA DE FONT DE GARACH,0849,13120,13041,Gardanne,13,,,13041000BK0224,,,84,,,,,,,,,,1,2,Appartement,55,3,,,,,,5.484739,43.445338
2021-177173,2021-02-08,000001,Vente,240000,44,,PAS DE NORIA DE FONT DE GARACH,0849,13120,13041,Gardanne,13,,,13041000BK0224,,,35,,,,,,,,,,1,3,Dépendance,,0,,,,,,5.484739,43.445338
2021-177173,2021-02-08,000001,Vente,240000,44,,PAS DE NORIA DE FONT DE GARACH,0849,13120,13041,Gardanne,13,,,13041000BK0224,,,36,,,,,,,,,,1,3,Dépendance,,0,,,,,,5.484739,43.445338
2021-177209,2021-02-09,000001,Vente,482000,300,,CHE ESTREC,0472,13120,13041,Gardanne,13,,,13041000BH0346,,,,,,,,,,,,,0,1,Maison,125,6,S,sols,,,640,5.478472,43.451443
2021-177209,2021-02-09,000001,Vente,482000,300,,CHE ESTREC,0472,13120,13041,Gardanne,13,,,13041000BH0346,,,,,,,,,,,,,0,3,Dépendance,,0,S,sols,,,640,5.478472,43.451443
2021-177231,2021-02-03,000001,Vente,141000,,,BIVER,B006,13120,13041,Gardanne,13,,,13041000CA0079,,,,,,,,,,,,,0,,,,,S,sols,,,3,5.467356,43.432504
2021-177231,2021-02-03,000001,Vente,141000,209,,AV DU PILON DU ROY,0895,13120,13041,Gardanne,13,,,13041000CA0660,,,,,,,,,,,,,0,1,Maison,75,3,S,sols,,,215,5.467282,43.432502
2021-177231,2021-02-03,000001,Vente,141000,9008,,BIVER LA PLACE,0230,13120,13041,Gardanne,13,,,13041000CA0802,,,,,,,,,,,,,0,,,,,S,sols,,,2,5.467217,43.432405
2021-177256,2021-01-27,000001,Vente,155000,9824,,MILHAUD,B033,13120,13041,Gardanne,13,,,130410000D0824,,,,,,,,,,,,,0,1,Maison,35,2,S,sols,,,142,5.452774,43.472564
2021-177256,2021-01-27,000001,Vente,155000,9824,,MILHAUD,B033,13120,13041,Gardanne,13,,,130410000D0824,,,,,,,,,,,,,0,1,Maison,24,1,S,sols,,,142,5.452774,43.472564
2021-177256,2021-01-27,000001,Vente,155000,,,MILHAUD,B033,13120,13041,Gardanne,13,,,130410000D0826,,,,,,,,,,,,,0,,,,,S,sols,,,61,5.452748,43.472682
2021-177361,2021-02-12,000001,Vente,165000,9001,,RES BEAUSOLEIL,A004,13120,13041,Gardanne,13,,,13041000BS0006,,,235,59.78,290,,,,,,,,2,2,Appartement,64,4,,,,,,5.471156,43.452186
2021-177361,2021-02-12,000001,Vente,165000,9001,,RES BEAUSOLEIL,A004,13120,13041,Gardanne,13,,,13041000BS0006,,,235,59.78,290,,,,,,,,2,3,Dépendance,,0,,,,,,5.471156,43.452186
2021-177385,2021-02-16,000001,Vente,242000,14,,RUE KRUGER,0670,13120,13041,Gardanne,13,,,13041000BB0233,,,,,,,,,,,,,0,2,Appartement,26,2,S,sols,,,60,5.468562,43.454898
2021-177385,2021-02-16,000001,Vente,242000,14,,RUE KRUGER,0670,13120,13041,Gardanne,13,,,13041000BB0233,,,,,,,,,,,,,0,2,Appartement,27,2,S,sols,,,60,5.468562,43.454898
2021-177385,2021-02-16,000001,Vente,242000,14,,RUE KRUGER,0670,13120,13041,Gardanne,13,,,13041000BB0233,,,,,,,,,,,,,0,3,Dépendance,,0,S,sols,,,60,5.468562,43.454898
2021-177385,2021-02-16,000001,Vente,242000,14,,RUE KRUGER,0670,13120,13041,Gardanne,13,,,13041000BB0233,,,,,,,,,,,,,0,2,Appartement,47,3,S,sols,,,60,5.468562,43.454898
2021-177388,2021-02-05,000001,Vente,120000,,,LA PLAINE NORD,B045,13120,13041,Gardanne,13,,,13041000CM0490,,,,,,,,,,,,,0,,,,,AB,terrains a bâtir,,,189,5.452471,43.445921
2021-177398,2021-02-01,000001,Vente,172400,9001,,RES MONTFERMEIL,A665,13120,13041,Gardanne,13,,,13041000AW0008,,,23,67.5,34,,,,,,,,2,3,Dépendance,,0,,,,,,5.475613,43.45961
2021-177398,2021-02-01,000001,Vente,172400,9001,,RES MONTFERMEIL,A665,13120,13041,Gardanne,13,,,13041000AW0008,,,23,67.5,34,,,,,,,,2,2,Appartement,68,3,,,,,,5.475613,43.45961
2021-177469,2021-02-15,000001,Vente,144000,68,,RES LE GAUGUIN,A310,13120,13041,Gardanne,13,,,13041000BH0002,,,211,,217,,,,,,,,2,3,Dépendance,,0,,,,,,5.474907,43.45349
2021-177469,2021-02-15,000001,Vente,144000,68,,RES LE GAUGUIN,A310,13120,13041,Gardanne,13,,,13041000BH0002,,,211,,217,,,,,,,,2,3,Dépendance,,0,,,,,,5.474907,43.45349
2021-177469,2021-02-15,000001,Vente,144000,68,,RES LE GAUGUIN,A310,13120,13041,Gardanne,13,,,13041000BH0002,,,211,,217,,,,,,,,2,2,Appartement,64,3,,,,,,5.474907,43.45349
2021-177471,2021-02-19,000001,Vente,4000,,,LE COUSTA,B018,13120,13041,Gardanne,13,,,13041000CP0253,,,,,,,,,,,,,0,,,,,AB,terrains a bâtir,,,11,5.459507,43.457043
2021-177500,2021-02-17,000001,Vente,420000,,,PAYANNET,B042,13120,13041,Gardanne,13,,,130410000A0217,,,,,,,,,,,,,0,,,,,BT,taillis simples,,,4230,5.477891,43.478806
2021-177500,2021-02-17,000001,Vente,420000,,,PAYANNET,B042,13120,13041,Gardanne,13,,,130410000A0218,,,,,,,,,,,,,0,,,,,VE,vergers,OLIVE,Oliveraie ou oliviers,2025,5.477728,43.478296
2021-177500,2021-02-17,000001,Vente,420000,,,PAYANNET,B042,13120,13041,Gardanne,13,,,130410000A0219,,,,,,,,,,,,,0,,,,,T,terres,,,720,5.477578,43.478105
2021-177500,2021-02-17,000001,Vente,420000,,,PAYANNET,B042,13120,13041,Gardanne,13,,,130410000A0221,,,,,,,,,,,,,0,,,,,S,sols,,,15,5.477309,43.47786
2021-177500,2021-02-17,000001,Vente,420000,,,PAYANNET,B042,13120,13041,Gardanne,13,,,130410000A0222,,,,,,,,,,,,,0,,,,,VE,vergers,OLIVE,Oliveraie ou oliviers,2310,5.477444,43.477793
2021-177500,2021-02-17,000001,Vente,420000,,,PAYANNET,B042,13120,13041,Gardanne,13,,,130410000A0222,,,,,,,,,,,,,0,,,,,S,sols,,,800,5.477444,43.477793
2021-177509,2021-02-16,000001,Vente,,,,FONT DE GARACH,B022,13120,13041,Gardanne,13,,,13041000BK0294,,,,,,,,,,,,,0,,,,,S,sols,,,350,5.483531,43.446001
2021-177509,2021-02-16,000001,Vente,,,,FONT DE GARACH,B022,13120,13041,Gardanne,13,,,13041000BK0295,,,,,,,,,,,,,0,,,,,S,sols,,,4,5.482841,43.446351
2021-177509,2021-02-16,000001,Vente,,,,FONT DE GARACH,B022,13120,13041,Gardanne,13,,,13041000BK0299,,,,,,,,,,,,,0,,,,,AB,terrains a bâtir,,,38,5.482877,43.446396
2021-177509,2021-02-16,000001,Vente,,,,FONT DE GARACH,B022,13120,13041,Gardanne,13,,,13041000BK0300,,,,,,,,,,,,,0,,,,,AB,terrains a bâtir,,,1368,5.48356,43.446202
2021-177509,2021-02-16,000001,Vente,,,,FONT DE GARACH,B022,13120,13041,Gardanne,13,,,13041000BK0311,,,,,,,,,,,,,0,,,,,AB,terrains a bâtir,,,499,5.483991,43.445946
2021-177517,2021-02-19,000001,Vente,125400,10,,AV DE TOULON,1100,13120,13041,Gardanne,13,,,13041000BD0032,,,7,37.16,,,,,,,,,1,3,Dépendance,,0,,,,,,5.471095,43.454384
2021-177517,2021-02-19,000001,Vente,125400,10,,AV DE TOULON,1100,13120,13041,Gardanne,13,,,13041000BD0032,,,7,37.16,,,,,,,,,1,2,Appartement,40,3,,,,,,5.471095,43.454384
2021-177521,2021-02-19,000001,Vente en l'état futur d'achèvement,189500,11,,AV DE NICE,0840,13120,13041,Gardanne,13,,,13041000AW0009,,,114,,,,,,,,,,1,,,,,,,,,,5.47567,43.459204
2021-177521,2021-02-19,000001,Vente en l'état futur d'achèvement,189500,11,,AV DE NICE,0840,13120,13041,Gardanne,13,,,13041000AW0009,,,4,,,,,,,,,,1,,,,,,,,,,5.47567,43.459204
2021-177540,2021-02-25,000001,Vente,319800,453,,AV PIERRE BROSSOLETTE,0912,13120,13041,Gardanne,13,,,13041000AV0338,,,,,,,,,,,,,0,1,Maison,85,3,S,sols,,,136,5.483851,43.45646
2021-177549,2021-02-25,000001,Vente en l'état futur d'achèvement,245000,,,LE RIBAS,B051,13120,13041,Gardanne,13,,,13041000AK0033,,,146,,,,,,,,,,1,,,,,,,,,,,
2021-177549,2021-02-25,000001,Vente en l'état futur d'achèvement,245000,,,LE RIBAS,B051,13120,13041,Gardanne,13,,,13041000AK0033,,,114,,,,,,,,,,1,,,,,,,,,,,
2021-177550,2021-02-25,000001,Vente en l'état futur d'achèvement,240000,,,LE RIBAS,B051,13120,13041,Gardanne,13,,,13041000AK0033,,,120,,,,,,,,,,1,,,,,,,,,,,
2021-177550,2021-02-25,000001,Vente en l'état futur d'achèvement,240000,,,LE RIBAS,B051,13120,13041,Gardanne,13,,,13041000AK0033,,,136,,,,,,,,,,1,,,,,,,,,,,
2021-177595,2021-02-22,000001,Vente,300000,11,,LOT CLOS DES PUITS,A024,13120,13041,Gardanne,13,,,13041000BR0068,,,11,84.3,,,,,,,,,1,1,Maison,80,4,,,,,,5.472057,43.4479
2021-177629,2021-02-22,000001,Vente,427600,6,,RES LES NORIAS,A669,13120,13041,Gardanne,13,,,13041000BK0121,,,,,,,,,,,,,0,3,Dépendance,,0,S,sols,,,421,5.479264,43.446873
2021-177629,2021-02-22,000001,Vente,427600,6,,RES LES NORIAS,A669,13120,13041,Gardanne,13,,,13041000BK0121,,,,,,,,,,,,,0,1,Maison,99,5,S,sols,,,421,5.479264,43.446873
2021-177631,2021-02-22,000001,Vente,210000,20,,RUE DES HORTENSIAS BIVER,0627,13120,13041,Gardanne,13,,,13041000CA0105,,,,,,,,,,,,,0,1,Maison,29,2,S,sols,,,111,5.471828,43.432298
2021-177663,2021-02-18,000001,Vente,331500,380,,BD SAVIO BIVER,1056,13120,13041,Gardanne,13,,,13041000CA0022,,,2,116.39,4,10,5,,,,,,3,3,Dépendance,,0,,,,,,5.470442,43.434009
2021-177663,2021-02-18,000001,Vente,331500,380,,BD SAVIO BIVER,1056,13120,13041,Gardanne,13,,,13041000CA0022,,,2,116.39,4,10,5,,,,,,3,2,Appartement,116,3,,,,,,5.470442,43.434009
2021-177731,2021-02-22,000001,Vente,170100,15,,RUE PASTEUR,0890,13120,13041,Gardanne,13,,,13041000BB0032,,,,,,,,,,,,,0,1,Maison,39,3,S,sols,,,47,5.46886,43.455614
2021-177741,2021-02-26,000001,Vente,156000,,,RUE HOCHE,0630,13120,13041,Gardanne,13,,,13041000AZ0239,,,,,,,,,,,,,0,,,,,AB,terrains a bâtir,,,461,5.466474,43.456102
2021-177783,2021-02-26,000001,Vente,460000,14,,CHE DES CRETES DE CAUVET,0447,13120,13041,Gardanne,13,,,13041000BY0159,,,,,,,,,,,,,0,3,Dépendance,,0,S,sols,,,551,5.465942,43.440301
2021-177783,2021-02-26,000001,Vente,460000,14,,CHE DES CRETES DE CAUVET,0447,13120,13041,Gardanne,13,,,13041000BY0159,,,,,,,,,,,,,0,1,Maison,112,5,S,sols,,,551,5.465942,43.440301
2021-177784,2021-02-26,000001,Vente,525000,21,,RUE HOCHE,0630,13120,13041,Gardanne,13,,,13041000AZ0241,,,,,,,,,,,,,0,1,Maison,141,5,S,sols,,,892,5.465295,43.456822
2021-177784,2021-02-26,000001,Vente,525000,21,,RUE HOCHE,0630,13120,13041,Gardanne,13,,,13041000AZ0241,,,,,,,,,,,,,0,3,Dépendance,,0,S,sols,,,892,5.465295,43.456822
2021-177784,2021-02-26,000001,Vente,525000,21,,RUE HOCHE,0630,13120,13041,Gardanne,13,,,13041000AZ0241,,,,,,,,,,,,,0,3,Dépendance,,0,S,sols,,,892,5.465295,43.456822
2021-177871,2021-02-22,000001,Vente,182214,180,,RUE PARADIS,0873,13120,13041,Gardanne,13,,,13041000AY0145,,,16,45.32,,,,,,,,,1,2,Appartement,44,2,,,,,,5.468185,43.457321
2021-177871,2021-02-22,000001,Vente,182214,180,,RUE PARADIS,0873,13120,13041,Gardanne,13,,,13041000AY0145,,,74,,,,,,,,,,1,3,Dépendance,,0,,,,,,5.468185,43.457321
2021-177888,2021-02-24,000001,Vente,592700,9888,,LA RABASSIERE,B049,13120,13041,Gardanne,13,,,130410000B0888,,,,,,,,,,,,,0,1,Maison,140,4,BT,taillis simples,,,1100,5.526944,43.438776
2021-177888,2021-02-24,000001,Vente,592700,9888,,LA RABASSIERE,B049,13120,13041,Gardanne,13,,,130410000B0888,,,,,,,,,,,,,0,1,Maison,140,4,S,sols,,,1000,5.526944,43.438776
2021-177918,2021-03-03,000001,Vente,145950,21,A,RUE PASTEUR,0890,13120,13041,Gardanne,13,,,13041000BB0036,,,6,43.94,7,,,,,,,,2,1,Maison,35,2,,,,,,5.468912,43.455482
2021-177919,2021-03-04,000001,Vente,40000,13,,BD CARNOT,0340,13120,13041,Gardanne,13,,,13041000BA0051,,,7,,8,38.1,,,,,,,2,4,Local industriel. commercial ou assimilé,25,0,,,,,,5.467463,43.454159
2021-177924,2021-02-09,000002,Vente,259000,9181,,RUE FONT DE GARACH,0490,13120,13041,Gardanne,13,,,13041000BK0178,,,,,,,,,,,,,0,,,,,AG,terrains d'agrément,,,500,5.481698,43.444715
2021-177924,2021-02-09,000002,Vente,259000,9181,,RUE FONT DE GARACH,0490,13120,13041,Gardanne,13,,,13041000BK0338,,,,,,,,,,,,,0,,,,,AG,terrains d'agrément,,,263,5.481554,43.444557
2021-177924,2021-02-09,000002,Vente,259000,9181,,RUE FONT DE GARACH,0490,13120,13041,Gardanne,13,,,13041000BK0341,,,,,,,,,,,,,0,,,,,AG,terrains d'agrément,,,73,5.481417,43.44443
2021-177925,2021-03-03,000001,Vente,163000,3,,VELINE ET CHEMIN ESTREC,B066,13120,13041,Gardanne,13,,,13041000BD0121,,,88,,,,,,,,,,1,3,Dépendance,,0,,,,,,5.473222,43.452945
2021-177925,2021-03-03,000001,Vente,163000,2,,VELINE ET CHEMIN ESTREC,B066,13120,13041,Gardanne,13,,,13041000BD0121,,,1,,9,64.4,,,,,,,2,2,Appartement,64,4,,,,,,5.473222,43.452945
2021-177967,2021-02-23,000001,Vente,825000,9003,,SAINT ROCH,B057,13120,13041,Gardanne,13,,,13041000AL0248,,,,,,,,,,,,,0,1,Maison,210,6,S,sols,,,717,5.478171,43.460355
2021-177967,2021-02-23,000001,Vente,825000,130,B,RUE ENSOULEIADO,0476,13120,13041,Gardanne,13,,,13041000AL0249,,,,,,,,,,,,,0,3,Dépendance,,0,AB,terrains a bâtir,,,909,5.477956,43.460377
2021-177988,2021-02-26,000001,Vente,200000,9032,,PESQUIER,B043,13120,13041,Gardanne,13,,,13041000BR0474,,,4,131.9,,,,,,,,,1,1,Maison,281,9,,,,,,5.471667,43.445899
2021-178020,2021-03-02,000001,Vente,245000,2,,LE COUSTA,B018,13120,13041,Gardanne,13,,,13041000CP0043,,,11,,14,,,,,,,,2,3,Dépendance,,0,,,,,,5.456318,43.45547
2021-178020,2021-03-02,000001,Vente,245000,2,,LE COUSTA,B018,13120,13041,Gardanne,13,,,13041000CP0043,,,11,,14,,,,,,,,2,3,Dépendance,,0,,,,,,5.456318,43.45547
2021-178020,2021-03-02,000001,Vente,245000,2,,LE COUSTA,B018,13120,13041,Gardanne,13,,,13041000CP0043,,,11,,14,,,,,,,,2,2,Appartement,60,2,,,,,,5.456318,43.45547
2021-178089,2021-03-12,000001,Vente,169200,16,,RUE PASTEUR,0890,13120,13041,Gardanne,13,,,13041000BB0048,,,4,73.79,,,,,,,,,1,2,Appartement,74,3,,,,,,5.468636,43.455511
2021-178090,2021-03-11,000001,Vente,380000,23,,LOT LES LAVANDINES,A515,13120,13041,Gardanne,13,,,13041000BH0175,,,,,,,,,,,,,0,1,Maison,75,4,S,sols,,,397,5.47971,43.449936
2021-178091,2021-03-15,000001,Vente,277350,9001,,RES LA CHENAIE,A011,13120,13041,Gardanne,13,,,13041000AS0005,,,18,101.52,,,,,,,,,1,2,Appartement,99,5,,,,,,5.487728,43.454276
2021-178091,2021-03-15,000001,Vente,277350,9001,,RES LA CHENAIE,A011,13120,13041,Gardanne,13,,,13041000AS0005,,,12,,,,,,,,,,1,3,Dépendance,,0,,,,,,5.487728,43.454276
2021-178162,2021-03-04,000001,Vente,150000,,,LES ANGLES,B004,13120,13041,Gardanne,13,,,13041000BV0060,,,,,,,,,,,,,0,,,,,T,terres,,,416,5.462606,43.442356
2021-178167,2021-03-10,000001,Vente,625000,9001,,RES NOTRE DAME,A673,13120,13041,Gardanne,13,,,13041000AS0042,,,,,,,,,,,,,0,1,Maison,148,6,S,sols,,,2846,5.488683,43.451632
2021-178218,2021-03-16,000002,Vente,33000,,,BIVER,B006,13120,13041,Gardanne,13,,,13041000BX0610,,,,,,,,,,,,,0,,,,,S,sols,,,275,5.463696,43.440118
2021-178218,2021-03-16,000002,Vente,33000,,,BIVER,B006,13120,13041,Gardanne,13,,,13041000BX0612,,,,,,,,,,,,,0,,,,,S,sols,,,253,5.463828,43.440117
2021-178221,2021-03-15,000001,Vente,363000,9419,,CHE DE LA PLAINE,0924,13120,13041,Gardanne,13,,,13041000CM0419,,,,,,,,,,,,,0,1,Maison,82,4,S,sols,,,543,5.459363,43.448171
2021-178221,2021-03-15,000001,Vente,363000,9419,,CHE DE LA PLAINE,0924,13120,13041,Gardanne,13,,,13041000CM0419,,,,,,,,,,,,,0,3,Dépendance,,0,S,sols,,,543,5.459363,43.448171
2021-178229,2021-03-17,000001,Vente en l'état futur d'achèvement,214500,11,,AV DE NICE,0840,13120,13041,Gardanne,13,,,13041000AW0009,,,110,,,,,,,,,,1,,,,,,,,,,5.47567,43.459204
2021-178229,2021-03-17,000001,Vente en l'état futur d'achèvement,214500,11,,AV DE NICE,0840,13120,13041,Gardanne,13,,,13041000AW0009,,,18,,,,,,,,,,1,,,,,,,,,,5.47567,43.459204
2021-178234,2021-03-10,000001,Vente en l'état futur d'achèvement,372000,,,FONT DE GARACH,B022,13120,13041,Gardanne,13,,,13041000BK0252,,,,,,,,,,,,,0,,,,,AB,terrains a bâtir,,,200,5.485216,43.44616
2021-178234,2021-03-10,000001,Vente en l'état futur d'achèvement,372000,,,FONT DE GARACH,B022,13120,13041,Gardanne,13,,,13041000BK0267,,,,,,,,,,,,,0,,,,,AB,terrains a bâtir,,,199,5.485364,43.446218
2021-178271,2021-03-12,000001,Vente,414000,59,,AV DE NICE,0840,13120,13041,Gardanne,13,,,13041000AL0243,,,,,,,,,,,,,0,1,Maison,182,7,S,sols,,,1115,5.48049,43.461163
2021-178271,2021-03-12,000001,Vente,414000,,,LE PALUN,B041,13120,13041,Gardanne,13,,,13041000AL0247,,,,,,,,,,,,,0,,,,,S,sols,,,68,5.480347,43.461271
2021-178276,2021-03-16,000001,Vente,11450,,,PAYANNET,B042,13120,13041,Gardanne,13,,,13041000AA0056,,,,,,,,,,,,,0,,,,,T,terres,,,2792,5.471781,43.472564
2021-178276,2021-03-16,000001,Vente,11450,,,PAYANNET,B042,13120,13041,Gardanne,13,,,13041000AA0183,,,,,,,,,,,,,0,,,,,T,terres,,,1788,5.471953,43.47211
2021-178312,2021-03-29,000001,Vente,339000,11,,RUE DES BLEUETS BIVER,0112,13120,13041,Gardanne,13,,,13041000BX0239,,,,,,,,,,,,,0,1,Maison,29,2,S,sols,,,170,5.463549,43.439708
2021-178312,2021-03-29,000001,Vente,339000,12,,IMP DES BELLES DE NUIT BIVER,0111,13120,13041,Gardanne,13,,,13041000BX0242,,,,,,,,,,,,,0,1,Maison,29,2,S,sols,,,164,5.463573,43.439639
2021-178335,2021-03-15,000001,Vente,513500,47,,AV DE NICE,0840,13120,13041,Gardanne,13,,,13041000AL0045,,,,,,,,,,,,,0,1,Maison,63,3,S,sols,,,678,5.479027,43.460235
2021-178336,2021-03-15,000001,Vente,440000,49,,AV DE NICE,0840,13120,13041,Gardanne,13,,,13041000AL0044,,,,,,,,,,,,,0,1,Maison,63,2,S,sols,,,691,5.479116,43.460279
2021-178337,2021-03-18,000001,Vente en l'état futur d'achèvement,201500,11,,AV DE NICE,0840,13120,13041,Gardanne,13,,,13041000AW0009,,,42,,,,,,,,,,1,,,,,,,,,,5.47567,43.459204
2021-178337,2021-03-18,000001,Vente en l'état futur d'achèvement,201500,11,,AV DE NICE,0840,13120,13041,Gardanne,13,,,13041000AW0009,,,135,,,,,,,,,,1,,,,,,,,,,5.47567,43.459204
2021-178340,2021-03-26,000001,Vente,266340,42,,AV SAINTE VICTOIRE,1052,13120,13041,Gardanne,13,,,13041000AW0003,,,104,83.7,,,,,,,,,1,2,Appartement,83,4,,,,,,5.474999,43.459199