id_mutation,date_mutation,numero_disposition,nature_mutation,valeur_fonciere,adresse_numero,adresse_suffixe,adresse_nom_voie,adresse_code_voie,code_postal,code_commune,nom_commune,code_departement,ancien_code_commune,ancien_nom_commune,id_parcelle,ancien_id_parcelle,numero_volume,lot1_numero,lot1_surface_carrez,lot2_numero,lot2_surface_carrez,lot3_numero,lot3_surface_carrez,lot4_numero,lot4_surface_carrez,lot5_numero,lot5_surface_carrez,nombre_lots,code_type_local,type_local,surface_reelle_bati,nombre_pieces_principales,code_nature_culture,nature_culture,code_nature_culture_speciale,nature_culture_speciale,surface_terrain,longitude,latitude
2021-198452,2021-01-12,000001,Vente,46000,35,,RUE DES ACACIAS,1943,14630,14287,Frénouville,14,,,14287000AC0340,,,,,,,,,,,,,0,,,,,AB,terrains a bâtir,,,325,-0.26277,49.140984
2021-198593,2021-02-01,000001,Vente,150000,14,,RUE MADAME MORIN RUFFIER,0320,14630,14287,Frénouville,14,,,14287000AB0109,,,,,,,,,,,,,0,1,Maison,63,4,S,sols,,,474,-0.247825,49.138039
2021-198942,2021-02-16,000001,Vente,53000,24,,RUE DES FRESNES,1944,14630,14287,Frénouville,14,,,14287000AC0342,,,,,,,,,,,,,0,,,,,AB,terrains a bâtir,,,376,-0.262629,49.14121
2021-199181,2021-02-24,000001,Vente,49900,5,,RUE DES ACACIAS,1943,14630,14287,Frénouville,14,,,14287000AC0309,,,,,,,,,,,,,0,,,,,AB,terrains a bâtir,,,355,-0.26254,49.139366
2021-199206,2021-02-17,000001,Vente,175800,13,,RUE ROGER DUPONT,1780,14630,14287,Frénouville,14,,,14287000AB0136,,,,,,,,,,,,,0,1,Maison,132,6,S,sols,,,184,-0.243972,49.135636
2021-199343,2021-03-02,000001,Vente,172000,14,,RUE DU ONZE NOVEMBRE,0760,14630,14287,Frénouville,14,,,14287000AB0306,,,,,,,,,,,,,0,1,Maison,80,4,S,sols,,,424,-0.242718,49.136067
2021-199343,2021-03-02,000001,Vente,172000,14,,RUE DU ONZE NOVEMBRE,0760,14630,14287,Frénouville,14,,,14287000AB0306,,,,,,,,,,,,,0,3,Dépendance,,0,S,sols,,,424,-0.242718,49.136067
2021-199343,2021-03-02,000001,Vente,172000,14,,RUE DU ONZE NOVEMBRE,0760,14630,14287,Frénouville,14,,,14287000AB0306,,,,,,,,,,,,,0,3,Dépendance,,0,S,sols,,,424,-0.242718,49.136067
2021-199343,2021-03-02,000001,Vente,172000,,,RUE DU ONZE NOVEMBRE,0760,14630,14287,Frénouville,14,,,14287000AB0307,,,,,,,,,,,,,0,,,,,S,sols,,,34,-0.242574,49.136061
2021-199538,2021-03-12,000001,Vente,195300,17,,RUE DU ONZE NOVEMBRE,0760,14630,14287,Frénouville,14,,,14287000ZB0068,,,,,,,,,,,,,0,1,Maison,91,6,S,sols,,,599,-0.241548,49.135688
2021-199538,2021-03-12,000001,Vente,195300,,,RUE DU ONZE NOVEMBRE,0760,14630,14287,Frénouville,14,,,14287000ZB0069,,,,,,,,,,,,,0,,,,,S,sols,,,246,-0.241641,49.135813
2021-199769,2021-03-22,000001,Vente,165000,7,,CHE AUX BOEUFS,0027,14630,14287,Frénouville,14,,,14287000ZB0432,,,,,,,,,,,,,0,1,Maison,88,4,S,sols,,,555,-0.245132,49.134635
2021-199862,2021-03-31,000002,Vente,4000,,,LES LONGRAIS,B051,14630,14287,Frénouville,14,,,14287000ZC0057,,,,,,,,,,,,,0,,,,,T,terres,,,4670,-0.24393,49.130293
2021-199891,2021-04-14,000001,Vente,200000,5,,RUE DU SIX JUIN 1944,1860,14630,14287,Frénouville,14,,,14287000AB0106,,,,,,,,,,,,,0,1,Maison,83,3,S,sols,,,586,-0.247554,49.138468
2021-199936,2021-04-07,000001,Vente,55500,2,,IMP DES VERDIERS,1940,14630,14287,Frénouville,14,,,14287000AC0145,,,,,,,,,,,,,0,,,,,AB,terrains a bâtir,,,409,-0.260824,49.139613
2021-200470,2021-04-23,000001,Vente,139500,4,,RUE MADAME MORIN RUFFIER,0320,14630,14287,Frénouville,14,,,14287000AB0115,,,,,,,,,,,,,0,1,Maison,63,4,S,sols,,,481,-0.248858,49.137389
2021-200521,2021-04-23,000001,Vente,236000,2,,IMP LES CAMPAGNETTES,0050,14630,14287,Frénouville,14,,,14287000ZH0129,,,,,,,,,,,,,0,1,Maison,122,8,S,sols,,,682,-0.252095,49.132549
2021-200575,2021-04-29,000001,Vente,49000,,,RUE DES FRESNES,1944,14630,14287,Frénouville,14,,,14287000AC0409,,,,,,,,,,,,,0,,,,,S,sols,,,197,-0.262211,49.141502
2021-200575,2021-04-29,000001,Vente,49000,,,RUE DES FRESNES,1944,14630,14287,Frénouville,14,,,14287000AC0412,,,,,,,,,,,,,0,,,,,S,sols,,,157,-0.262288,49.141524
2021-201407,2021-04-23,000001,Vente,155000,47,,RUE DU ONZE NOVEMBRE,0760,14630,14287,Frénouville,14,,,14287000ZB0458,,,,,,,,,,,,,0,1,Maison,133,8,J,jardins,,,530,-0.238347,49.132971
2021-201407,2021-04-23,000001,Vente,155000,47,,RUE DU ONZE NOVEMBRE,0760,14630,14287,Frénouville,14,,,14287000ZB0458,,,,,,,,,,,,,0,1,Maison,133,8,S,sols,,,500,-0.238347,49.132971
2021-201461,2021-06-08,000001,Vente,62000,8,,RUE DU MARECHAL FOCH,0400,14630,14287,Frénouville,14,,,14287000AB0344,,,,,,,,,,,,,0,1,Maison,35,1,S,sols,,,38,-0.245218,49.136649
2021-201540,2021-06-16,000001,Vente,63000,,,LES EVIGNETTES,B034,14630,14287,Frénouville,14,,,14287000AC0388,,,,,,,,,,,,,0,,,,,AB,terrains a bâtir,,,477,-0.259533,49.139043
2021-201618,2021-06-23,000001,Vente,100000,15,,RUE DE LA VALETTE,1938,14630,14287,Frénouville,14,,,14287000ZB0517,,,,,,,,,,,,,0,1,Maison,115,5,S,sols,,,800,-0.237007,49.133413
2021-201719,2021-06-21,000001,Vente,45000,,,LES EVIGNETTES,B034,14630,14287,Frénouville,14,,,14287000AC0390,,,,,,,,,,,,,0,,,,,AB,terrains a bâtir,,,331,-0.259744,49.138843
2021-201720,2021-06-22,000001,Vente,47000,,,LES EVIGNETTES,B034,14630,14287,Frénouville,14,,,14287000AC0393,,,,,,,,,,,,,0,,,,,AB,terrains a bâtir,,,342,-0.261526,49.139548
2021-201720,2021-06-22,000001,Vente,47000,,,LES EVIGNETTES,B034,14630,14287,Frénouville,14,,,14287000AC0400,,,,,,,,,,,,,0,,,,,S,sols,,,13,-0.261628,49.139562
2021-201721,2021-06-30,000001,Vente,37000,,,LES EVIGNETTES,B034,14630,14287,Frénouville,14,,,14287000AC0397,,,,,,,,,,,,,0,,,,,AB,terrains a bâtir,,,281,-0.260687,49.139977
2021-201722,2021-06-21,000001,Vente,47000,,,LES EVIGNETTES,B034,14630,14287,Frénouville,14,,,14287000AC0395,,,,,,,,,,,,,0,,,,,AB,terrains a bâtir,,,323,-0.261064,49.139697
2021-201863,2021-06-21,000001,Vente,47000,,,LES EVIGNETTES,B034,14630,14287,Frénouville,14,,,14287000AC0389,,,,,,,,,,,,,0,,,,,AB,terrains a bâtir,,,341,-0.259887,49.138964
2021-201932,2021-07-08,000001,Vente,163000,,,RUE DE LA LIBERATION,0280,14630,14287,Frénouville,14,,,14287000AB0279,,,,,,,,,,,,,0,,,,,S,sols,,,27,-0.243187,49.137212
2021-201932,2021-07-08,000001,Vente,163000,3,,RUE DU MARAIS,0375,14630,14287,Frénouville,14,,,14287000AB0281,,,,,,,,,,,,,0,1,Maison,65,3,S,sols,,,92,-0.243286,49.137235
2021-201970,2021-07-15,000001,Vente,55000,26,B,LES CARRIERES,B011,14630,14287,Frénouville,14,,,14287000ZB0198,,,,,,,,,,,,,0,,,,,S,sols,,,64,-0.240592,49.134466
2021-201970,2021-07-15,000001,Vente,55000,26,,RUE DU ONZE NOVEMBRE,0760,14630,14287,Frénouville,14,,,14287000ZB0585,,,,,,,,,,,,,0,4,Local industriel. commercial ou assimilé,43,0,S,sols,,,11,-0.240667,49.134422
2021-202007,2021-07-12,000001,Vente,51500,13,,RUE DES FRESNES,1944,14630,14287,Frénouville,14,,,14287000AC0327,,,,,,,,,,,,,0,,,,,AB,terrains a bâtir,,,364,-0.261666,49.140822
2021-202068,2021-07-02,000001,Vente,66000,,,LES EVIGNETTES,B034,14630,14287,Frénouville,14,,,14287000AC0391,,,,,,,,,,,,,0,,,,,AB,terrains a bâtir,,,489,-0.259484,49.138781
2021-202068,2021-07-02,000001,Vente,66000,,,RUE FRED SCAMARONI,0167,14630,14287,Frénouville,14,,,14287000AC0401,,,,,,,,,,,,,0,,,,,AB,terrains a bâtir,,,20,-0.25945,49.138682
2021-202128,2021-06-25,000001,Vente,319000,1,,RUE DES DUCS DE NORMANDIE,0122,14630,14287,Frénouville,14,,,14287000AC0098,,,,,,,,,,,,,0,1,Maison,116,4,S,sols,,,720,-0.260503,49.14191
2021-202565,2021-08-02,000001,Vente,240000,1,,RUE ROGER DUPONT,1780,14630,14287,Frénouville,14,,,14287000AB0051,,,,,,,,,,,,,0,1,Maison,240,8,S,sols,,,1075,-0.243661,49.136671
2021-202565,2021-08-02,000001,Vente,240000,,,RUE DU ONZE NOVEMBRE,0760,14630,14287,Frénouville,14,,,14287000AB0396,,,,,,,,,,,,,0,,,,,J,jardins,,,508,-0.243442,49.136295
2021-202717,2021-08-10,000001,Vente,37675,,,LES EVIGNETTES,B034,14630,14287,Frénouville,14,,,14287000AC0398,,,,,,,,,,,,,0,,,,,AB,terrains a bâtir,,,281,-0.260504,49.140053
2021-202961,2021-08-19,000001,Vente,205000,1,,RUE DE LA LIBERATION,0280,14630,14287,Frénouville,14,,,14287000AB0297,,,,,,,,,,,,,0,1,Maison,104,4,S,sols,,,451,-0.244465,49.137688
2021-202961,2021-08-19,000001,Vente,205000,1,,RUE DE LA LIBERATION,0280,14630,14287,Frénouville,14,,,14287000AB0297,,,,,,,,,,,,,0,1,Maison,44,3,S,sols,,,451,-0.244465,49.137688
2021-202968,2021-08-25,000001,Vente,47000,33,,RUE DES ACACIAS,1943,14630,14287,Frénouville,14,,,14287000AC0339,,,,,,,,,,,,,0,,,,,AB,terrains a bâtir,,,334,-0.262878,49.140855
2021-203124,2021-08-09,000001,Vente,204000,5,,IMP CALMETTE,0040,14630,14287,Frénouville,14,,,14287000AB0168,,,,,,,,,,,,,0,1,Maison,88,5,S,sols,,,592,-0.248373,49.138394
2021-203205,2021-09-02,000001,Vente,32000,,,DELLE DES GRANDES PARTS,B028,14630,14287,Frénouville,14,,,14287000ZI0062,,,,,,,,,,,,,0,,,,,E,eaux,,,2650,-0.224114,49.14013
2021-203205,2021-09-02,000001,Vente,32000,,,DELLE DES GRANDES PARTS,B028,14630,14287,Frénouville,14,,,14287000ZI0062,,,,,,,,,,,,,0,,,,,BT,taillis simples,,,20260,-0.224114,49.14013
2021-203223,2021-08-13,000001,Vente,319150,29,,RUE DE LA VALETTE,1938,14630,14287,Frénouville,14,,,14287000ZB0524,,,,,,,,,,,,,0,3,Dépendance,,0,S,sols,,,930,-0.237621,49.132308
2021-203223,2021-08-13,000001,Vente,319150,29,,RUE DE LA VALETTE,1938,14630,14287,Frénouville,14,,,14287000ZB0524,,,,,,,,,,,,,0,1,Maison,120,4,S,sols,,,930,-0.237621,49.132308
2021-203281,2021-08-20,000001,Vente,196900,4,,IMP DES FAUVETTES,0156,14630,14287,Frénouville,14,,,14287000AC0115,,,,,,,,,,,,,0,1,Maison,82,4,S,sols,,,421,-0.259654,49.140076
2021-203303,2021-09-02,000001,Vente,235600,3,,RUE DES ACACIAS,1943,14630,14287,Frénouville,14,,,14287000AC0308,,,,,,,,,,,,,0,1,Maison,100,4,S,sols,,,349,-0.262264,49.139409
2021-203304,2021-09-08,000001,Vente,229000,1,,RUE DU ONZE NOVEMBRE,0760,14630,14287,Frénouville,14,,,14287000ZB0060,,,,,,,,,,,,,0,1,Maison,109,6,S,sols,,,599,-0.24304,49.136965
2021-203394,2021-09-16,000001,Vente,276900,6,,RUE DU GRAND VAL,0171,14630,14287,Frénouville,14,,,14287000ZH0144,,,,,,,,,,,,,0,1,Maison,100,6,S,sols,,,651,-0.252212,49.133193
2021-203394,2021-09-16,000001,Vente,276900,6,,RUE DU GRAND VAL,0171,14630,14287,Frénouville,14,,,14287000ZH0144,,,,,,,,,,,,,0,3,Dépendance,,0,S,sols,,,651,-0.252212,49.133193
2021-203758,2021-09-28,000001,Vente,238600,6,,RUE DU BOSQUET,0028,14630,14287,Frénouville,14,,,14287000ZB0477,,,,,,,,,,,,,0,1,Maison,94,5,S,sols,,,708,-0.238353,49.135912
2021-203824,2021-09-20,000001,Vente,267850,2,,CHE AUX BOEUFS,0027,14630,14287,Frénouville,14,,,14287000ZB0442,,,,,,,,,,,,,0,1,Maison,150,4,S,sols,,,602,-0.245413,49.134159
2021-203842,2021-10-08,000001,Vente,277500,9,,RUE DU MARECHAL FOCH,0400,14630,14287,Frénouville,14,,,14287000AB0326,,,,,,,,,,,,,0,1,Maison,180,5,S,sols,,,416,-0.244604,49.1365
2021-203842,2021-10-08,000001,Vente,277500,9,,RUE DU MARECHAL FOCH,0400,14630,14287,Frénouville,14,,,14287000AB0326,,,,,,,,,,,,,0,3,Dépendance,,0,S,sols,,,416,-0.244604,49.1365
2021-203855,2021-10-04,000001,Vente,295000,26,,RUE DU ONZE NOVEMBRE,0760,14630,14287,Frénouville,14,,,14287000ZB0586,,,,,,,,,,,,,0,1,Maison,99,5,S,sols,,,691,-0.240653,49.134452
2021-203855,2021-10-04,000001,Vente,295000,26,,RUE DU ONZE NOVEMBRE,0760,14630,14287,Frénouville,14,,,14287000ZB0586,,,,,,,,,,,,,0,3,Dépendance,,0,S,sols,,,691,-0.240653,49.134452
2021-203860,2021-09-29,000001,Vente,227000,2,B,AV MAL DE LATTRE DE TASSIGNY,0380,14630,14287,Frénouville,14,,,14287000AB0155,,,,,,,,,,,,,0,1,Maison,98,4,S,sols,,,468,-0.247583,49.136668
2021-205135,2021-12-01,000001,Vente,205000,4,,IMP CALMETTE,0040,14630,14287,Frénouville,14,,,14287000AB0173,,,,,,,,,,,,,0,1,Maison,88,5,S,sols,,,575,-0.248387,49.138839
2021-205419,2021-12-17,000001,Vente,90000,32,,RUE DU ONZE NOVEMBRE,0760,14630,14287,Frénouville,14,,,14287000ZB0227,,,,,,,,,,,,,0,1,Maison,87,4,S,sols,,,649,-0.239874,49.133756
2021-205584,2021-12-23,000001,Vente,262000,4,,RUE DE LA CROIX GRENTE,0116,14630,14287,Frénouville,14,,,14287000ZB0452,,,,,,,,,,,,,0,1,Maison,147,7,S,sols,,,857,-0.240142,49.135308
2021-205757,2021-12-30,000001,Vente,67000,12,,RUE DES EVIGNETTES,0142,14630,14287,Frénouville,14,,,14287000AC0212,,,,,,,,,,,,,0,,,,,AB,terrains a bâtir,,,498,-0.260772,49.140526
