id_mutation,date_mutation,numero_disposition,nature_mutation,valeur_fonciere,adresse_numero,adresse_suffixe,adresse_nom_voie,adresse_code_voie,code_postal,code_commune,nom_commune,code_departement,ancien_code_commune,ancien_nom_commune,id_parcelle,ancien_id_parcelle,numero_volume,lot1_numero,lot1_surface_carrez,lot2_numero,lot2_surface_carrez,lot3_numero,lot3_surface_carrez,lot4_numero,lot4_surface_carrez,lot5_numero,lot5_surface_carrez,nombre_lots,code_type_local,type_local,surface_reelle_bati,nombre_pieces_principales,code_nature_culture,nature_culture,code_nature_culture_speciale,nature_culture_speciale,surface_terrain,longitude,latitude
2021-214904,2021-01-15,000001,Vente,275000,5062,,LES SIX CHEMINS,B172,14430,14598,Saint-Jouin,14,,,145980000C0174,,,,,,,,,,,,,0,1,Maison,107,6,S,sols,,,1000,0.004122,49.225187
2021-214904,2021-01-15,000001,Vente,275000,5062,,LES SIX CHEMINS,B172,14430,14598,Saint-Jouin,14,,,145980000C0174,,,,,,,,,,,,,0,1,Maison,107,6,AG,terrains d'agrément,,,1076,0.004122,49.225187
2021-214904,2021-01-15,000001,Vente,275000,5062,,LES SIX CHEMINS,B172,14430,14598,Saint-Jouin,14,,,145980000C0175,,,,,,,,,,,,,0,1,Maison,140,1,S,sols,,,1000,0.003855,49.225008
2021-214904,2021-01-15,000001,Vente,275000,5062,,LES SIX CHEMINS,B172,14430,14598,Saint-Jouin,14,,,145980000C0175,,,,,,,,,,,,,0,1,Maison,140,1,AG,terrains d'agrément,,,286,0.003855,49.225008
2021-214937,2021-02-05,000001,Vente,175000,5,,RTE DE CAMBREMER,0040,14430,14598,Saint-Jouin,14,,,145980000A0268,,,,,,,,,,,,,0,3,Dépendance,,0,PP,prés plantes,,,4738,-0.026987,49.22133
2021-214937,2021-02-05,000001,Vente,175000,5,,RTE DE CAMBREMER,0040,14430,14598,Saint-Jouin,14,,,145980000A0268,,,,,,,,,,,,,0,3,Dépendance,,0,PP,prés plantes,,,4738,-0.026987,49.22133
2021-214937,2021-02-05,000001,Vente,175000,5,,RTE DE CAMBREMER,0040,14430,14598,Saint-Jouin,14,,,145980000A0268,,,,,,,,,,,,,0,1,Maison,63,3,PP,prés plantes,,,4738,-0.026987,49.22133
2021-215556,2021-03-31,000001,Vente,412150,5043,,LA PTE FORET,B165,14430,14598,Saint-Jouin,14,,,145980000A0128,,,,,,,,,,,,,0,1,Maison,110,5,S,sols,,,1060,-0.015226,49.215591
2021-215556,2021-03-31,000001,Vente,412150,,,LES VIVES TERRES,B182,14430,14598,Saint-Jouin,14,,,145980000A0450,,,,,,,,,,,,,0,,,,,P,prés,,,17231,-0.016323,49.215566
2021-216138,2021-05-19,000001,Vente,12000,,,LE CALVAIRE,B018,14430,14598,Saint-Jouin,14,,,145980000A0195,,,,,,,,,,,,,0,,,,,P,prés,,,6500,-0.026124,49.214923
2021-216138,2021-05-19,000001,Vente,12000,,,LE CALVAIRE,B018,14430,14598,Saint-Jouin,14,,,145980000A0196,,,,,,,,,,,,,0,,,,,S,sols,,,28,-0.026497,49.214869
2021-217275,2021-08-02,000001,Vente,630000,,,L AULNAIE,B002,14430,14598,Saint-Jouin,14,,,145980000A0114,,,,,,,,,,,,,0,,,,,PP,prés plantes,,,10220,-0.020209,49.217607
2021-217275,2021-08-02,000001,Vente,630000,,,COSTIL DE BAS,B027,14430,14598,Saint-Jouin,14,,,145980000A0115,,,,,,,,,,,,,0,,,,,P,prés,,,8220,-0.019179,49.218635
2021-217275,2021-08-02,000001,Vente,630000,,,LES BIEZ,B006,14430,14598,Saint-Jouin,14,,,145980000A0119,,,,,,,,,,,,,0,,,,,S,sols,,,450,-0.017857,49.218984
2021-217275,2021-08-02,000001,Vente,630000,,,LES BIEZ,B006,14430,14598,Saint-Jouin,14,,,145980000A0119,,,,,,,,,,,,,0,,,,,PP,prés plantes,,,23776,-0.017857,49.218984
2021-217275,2021-08-02,000001,Vente,630000,,,LES BIEZ,B006,14430,14598,Saint-Jouin,14,,,145980000A0120,,,,,,,,,,,,,0,,,,,S,sols,,,45,-0.018414,49.219035
2021-217275,2021-08-02,000001,Vente,630000,,,COUR DEVILLERS,B049,14430,14598,Saint-Jouin,14,,,145980000A0122,,,,,,,,,,,,,0,,,,,J,jardins,POTAG,Jardin potager,460,-0.018868,49.217232
2021-217275,2021-08-02,000001,Vente,630000,,,COUR DEVILLERS,B049,14430,14598,Saint-Jouin,14,,,145980000A0123,,,,,,,,,,,,,0,,,,,J,jardins,POTAG,Jardin potager,300,-0.018339,49.217064
2021-217275,2021-08-02,000001,Vente,630000,35,,CHE DE L'EGLISE,0060,14430,14598,Saint-Jouin,14,,,145980000A0125,,,,,,,,,,,,,0,,,,,PP,prés plantes,,,8860,-0.017082,49.217836
2021-217275,2021-08-02,000001,Vente,630000,,,COSTIL GEORGET,B028,14430,14598,Saint-Jouin,14,,,145980000A0175,,,,,,,,,,,,,0,,,,,PP,prés plantes,,,10120,-0.020542,49.215605
2021-217275,2021-08-02,000001,Vente,630000,,,LA QUETTERIE,B075,14430,14598,Saint-Jouin,14,,,145980000A0176,,,,,,,,,,,,,0,,,,,BT,taillis simples,,,5350,-0.02059,49.216146
2021-217275,2021-08-02,000001,Vente,630000,,,LA QUETTERIE,B075,14430,14598,Saint-Jouin,14,,,145980000A0177,,,,,,,,,,,,,0,,,,,P,prés,,,3260,-0.021152,49.216626
2021-217275,2021-08-02,000001,Vente,630000,,,LA QUETTERIE,B075,14430,14598,Saint-Jouin,14,,,145980000A0180,,,,,,,,,,,,,0,,,,,PP,prés plantes,,,9371,-0.022018,49.216277
2021-217275,2021-08-02,000001,Vente,630000,,,LA QUETTERIE,B075,14430,14598,Saint-Jouin,14,,,145980000A0181,,,,,,,,,,,,,0,,,,,S,sols,,,39,-0.022249,49.216262
2021-217275,2021-08-02,000001,Vente,630000,5044,,COUR DEVILLERS,B049,14430,14598,Saint-Jouin,14,,,145980000A0439,,,,,,,,,,,,,0,3,Dépendance,,0,PP,prés plantes,,,23045,-0.018857,49.217578
2021-217275,2021-08-02,000001,Vente,630000,5044,,COUR DEVILLERS,B049,14430,14598,Saint-Jouin,14,,,145980000A0439,,,,,,,,,,,,,0,1,Maison,145,5,PP,prés plantes,,,23045,-0.018857,49.217578
2021-217275,2021-08-02,000001,Vente,630000,5044,,COUR DEVILLERS,B049,14430,14598,Saint-Jouin,14,,,145980000A0439,,,,,,,,,,,,,0,3,Dépendance,,0,S,sols,,,1000,-0.018857,49.217578
2021-217275,2021-08-02,000001,Vente,630000,5044,,COUR DEVILLERS,B049,14430,14598,Saint-Jouin,14,,,145980000A0439,,,,,,,,,,,,,0,1,Maison,24,1,S,sols,,,1000,-0.018857,49.217578
2021-217275,2021-08-02,000001,Vente,630000,5044,,COUR DEVILLERS,B049,14430,14598,Saint-Jouin,14,,,145980000A0439,,,,,,,,,,,,,0,1,Maison,60,3,PP,prés plantes,,,23045,-0.018857,49.217578
2021-217275,2021-08-02,000001,Vente,630000,5044,,COUR DEVILLERS,B049,14430,14598,Saint-Jouin,14,,,145980000A0439,,,,,,,,,,,,,0,1,Maison,38,2,PP,prés plantes,,,23045,-0.018857,49.217578
2021-217275,2021-08-02,000001,Vente,630000,5044,,COUR DEVILLERS,B049,14430,14598,Saint-Jouin,14,,,145980000A0439,,,,,,,,,,,,,0,1,Maison,38,2,S,sols,,,1000,-0.018857,49.217578
2021-217275,2021-08-02,000001,Vente,630000,5044,,COUR DEVILLERS,B049,14430,14598,Saint-Jouin,14,,,145980000A0439,,,,,,,,,,,,,0,1,Maison,60,3,S,sols,,,1000,-0.018857,49.217578
2021-217275,2021-08-02,000001,Vente,630000,5044,,COUR DEVILLERS,B049,14430,14598,Saint-Jouin,14,,,145980000A0439,,,,,,,,,,,,,0,1,Maison,145,5,S,sols,,,1000,-0.018857,49.217578
2021-217275,2021-08-02,000001,Vente,630000,5044,,COUR DEVILLERS,B049,14430,14598,Saint-Jouin,14,,,145980000A0439,,,,,,,,,,,,,0,1,Maison,24,1,PP,prés plantes,,,23045,-0.018857,49.217578
2021-217275,2021-08-02,000001,Vente,630000,,,LA QUETTERIE,B075,14430,14598,Saint-Jouin,14,,,145980000A0440,,,,,,,,,,,,,0,,,,,PP,prés plantes,,,3023,-0.021354,49.215652
2021-217275,2021-08-02,000001,Vente,630000,,,LA QUETTERIE,B075,14430,14598,Saint-Jouin,14,,,145980000A0440,,,,,,,,,,,,,0,,,,,S,sols,,,320,-0.021354,49.215652
2021-218166,2021-10-27,000001,Vente,65000,12,,RUE CHARLES EMILE PINSON,0050,14430,14598,Saint-Jouin,14,,,145980000C0190,,,,,,,,,,,,,0,,,,,AB,terrains a bâtir,,,1041,0.000843,49.221937
2021-218599,2021-11-24,000001,Vente,26000,,,COUR TINEL,B066,14430,14598,Saint-Jouin,14,,,145980000A0173,,,,,,,,,,,,,0,,,,,P,prés,,,32588,-0.018846,49.216482
2021-218599,2021-11-24,000001,Vente,26000,,,COUR TINEL,B066,14430,14598,Saint-Jouin,14,,,145980000A0174,,,,,,,,,,,,,0,,,,,S,sols,,,65,-0.018436,49.216746
