id_mutation,date_mutation,numero_disposition,nature_mutation,valeur_fonciere,adresse_numero,adresse_suffixe,adresse_nom_voie,adresse_code_voie,code_postal,code_commune,nom_commune,code_departement,ancien_code_commune,ancien_nom_commune,id_parcelle,ancien_id_parcelle,numero_volume,lot1_numero,lot1_surface_carrez,lot2_numero,lot2_surface_carrez,lot3_numero,lot3_surface_carrez,lot4_numero,lot4_surface_carrez,lot5_numero,lot5_surface_carrez,nombre_lots,code_type_local,type_local,surface_reelle_bati,nombre_pieces_principales,code_nature_culture,nature_culture,code_nature_culture_speciale,nature_culture_speciale,surface_terrain,longitude,latitude
2021-221806,2021-05-07,000001,Vente,15000,,,TEISSONNIERES,B042,15200,15010,Arches,15,,,150100000A0026,,,,,,,,,,,,,0,,,,,T,terres,,,7840,2.315646,45.310675
2021-221806,2021-05-07,000001,Vente,15000,,,LA CHABANE,B009,15200,15010,Arches,15,,,150100000A0050,,,,,,,,,,,,,0,,,,,T,terres,,,6210,2.315612,45.309957
2021-221806,2021-05-07,000001,Vente,15000,,,LA CHABANE,B009,15200,15010,Arches,15,,,150100000A0055,,,,,,,,,,,,,0,,,,,P,prés,,,11860,2.315007,45.309108
2021-221806,2021-05-07,000001,Vente,15000,,,LA CHABANE,B009,15200,15010,Arches,15,,,150100000A0057,,,,,,,,,,,,,0,,,,,BT,taillis simples,,,700,2.3153,45.308428
2021-222802,2021-07-27,000001,Vente,70000,5120,,CHABANNES EST,B011,15200,15010,Arches,15,,,150100000C0257,,,,,,,,,,,,,0,1,Maison,64,2,S,sols,,,495,2.341932,45.29498
2021-222802,2021-07-27,000001,Vente,70000,,,CHABANNES EST,B011,15200,15010,Arches,15,,,150100000C0333,,,,,,,,,,,,,0,,,,,S,sols,,,960,2.342031,45.294995
2021-223489,2021-09-04,000001,Vente,2200,,,LA PIERRE PLATE,B033,15200,15010,Arches,15,,,150100000A0363,,,,,,,,,,,,,0,,,,,T,terres,,,5850,2.321384,45.301946
2021-223648,2021-09-18,000001,Vente,144400,5001,,LAJARRIGE,B023,15200,15010,Arches,15,,,150100000B0319,,,,,,,,,,,,,0,1,Maison,100,6,S,sols,,,1280,2.332073,45.311062
2021-223648,2021-09-18,000001,Vente,144400,,,LAJARRIGE,B023,15200,15010,Arches,15,,,150100000B0411,,,,,,,,,,,,,0,,,,,PA,pâtures,,,825,2.331978,45.311446
2021-223705,2021-09-22,000001,Vente,3804,,,LE BOURG,B005,15200,15010,Arches,15,,,150100000A0508,,,,,,,,,,,,,0,,,,,S,sols,,,791,2.325107,45.307503
2021-223705,2021-09-22,000001,Vente,3804,,,LE BOURG,B005,15200,15010,Arches,15,,,150100000A0509,,,,,,,,,,,,,0,,,,,P,prés,,,58,2.325975,45.307557
2021-223705,2021-09-22,000001,Vente,3804,,,LE BOURG,B005,15200,15010,Arches,15,,,150100000A0511,,,,,,,,,,,,,0,,,,,P,prés,,,738,2.324806,45.307553
2021-223705,2021-09-22,000001,Vente,3804,,,LE BOURG,B005,15200,15010,Arches,15,,,150100000A0513,,,,,,,,,,,,,0,,,,,S,sols,,,204,2.325263,45.307402
2021-223705,2021-09-22,000001,Vente,3804,,,LE BOURG,B005,15200,15010,Arches,15,,,150100000A0513,,,,,,,,,,,,,0,,,,,P,prés,,,1422,2.325263,45.307402
2021-223705,2021-09-22,000001,Vente,3804,,,LE BOURG,B005,15200,15010,Arches,15,,,150100000A0513,,,,,,,,,,,,,0,,,,,P,prés,,,1218,2.325263,45.307402
2021-223705,2021-09-22,000001,Vente,3804,,,LE BOURG,B005,15200,15010,Arches,15,,,150100000A0513,,,,,,,,,,,,,0,,,,,P,prés,,,1421,2.325263,45.307402
2021-224226,2021-11-02,000001,Vente,120000,6007,,LA PIERRE PLATE,B033,15200,15010,Arches,15,,,150100000A0477,,,,,,,,,,,,,0,1,Maison,90,3,S,sols,,,1030,2.327982,45.302431
2021-224925,2021-12-22,000001,Vente,60000,,,LE BOURG,B005,15200,15010,Arches,15,,,150100000A0149,,,,,,,,,,,,,0,,,,,J,jardins,,,125,2.327632,45.306641
2021-224925,2021-12-22,000001,Vente,60000,,,LE BOURG,B005,15200,15010,Arches,15,,,150100000A0537,,,,,,,,,,,,,0,,,,,J,jardins,,,115,2.32783,45.306713
2021-224925,2021-12-22,000001,Vente,60000,5036,,LE BOURG,B005,15200,15010,Arches,15,,,150100000A0538,,,,,,,,,,,,,0,1,Maison,110,5,S,sols,,,152,2.327794,45.306611
2021-224925,2021-12-22,000001,Vente,60000,,,LE BOURG,B005,15200,15010,Arches,15,,,150100000A0870,,,,,,,,,,,,,0,,,,,P,prés,,,103,2.327681,45.306739
2021-224992,2021-12-30,000002,Vente,35000,,,MONTFORT,B028,15200,15010,Arches,15,,,150100000D1036,,,,,,,,,,,,,0,,,,,PA,pâtures,,,210,2.307341,45.284514
2021-224992,2021-12-30,000002,Vente,35000,,,MONTFORT,B028,15200,15010,Arches,15,,,150100000D1038,,,,,,,,,,,,,0,,,,,S,sols,,,1394,2.306965,45.284555
2021-224992,2021-12-30,000002,Vente,35000,,,MONTFORT,B028,15200,15010,Arches,15,,,150100000D1040,,,,,,,,,,,,,0,,,,,P,prés,,,480,2.306682,45.284588
2021-224992,2021-12-30,000002,Vente,35000,,,MONTFORT,B028,15200,15010,Arches,15,,,150100000D1042,,,,,,,,,,,,,0,,,,,L,landes,,,117,2.306711,45.284417
