id_mutation,date_mutation,numero_disposition,nature_mutation,valeur_fonciere,adresse_numero,adresse_suffixe,adresse_nom_voie,adresse_code_voie,code_postal,code_commune,nom_commune,code_departement,ancien_code_commune,ancien_nom_commune,id_parcelle,ancien_id_parcelle,numero_volume,lot1_numero,lot1_surface_carrez,lot2_numero,lot2_surface_carrez,lot3_numero,lot3_surface_carrez,lot4_numero,lot4_surface_carrez,lot5_numero,lot5_surface_carrez,nombre_lots,code_type_local,type_local,surface_reelle_bati,nombre_pieces_principales,code_nature_culture,nature_culture,code_nature_culture_speciale,nature_culture_speciale,surface_terrain,longitude,latitude
2021-220820,2021-02-06,000001,Vente,113800,5014,,LA ROULEYRE,B106,15170,15080,Joursac,15,,,15080000ZK0053,,,,,,,,,,,,,0,1,Maison,98,5,S,sols,,,494,3.013061,45.143677
2021-220820,2021-02-06,000001,Vente,113800,5014,,LA ROULEYRE,B106,15170,15080,Joursac,15,,,15080000ZK0053,,,,,,,,,,,,,0,1,Maison,98,5,T,terres,,,946,3.013061,45.143677
2021-221073,2021-03-11,000001,Vente,2300,,,BRYTE,B016,15170,15080,Joursac,15,,,15080000ZN0116,,,,,,,,,,,,,0,,,,,P,prés,,,7160,3.008069,45.135461
2021-221208,2021-03-20,000001,Vente,21698,5126,,PLAMONTEIL,B078,15170,15080,Joursac,15,,,15080000ZA0018,,,,,,,,,,,,,0,1,Maison,120,5,S,sols,,,250,3.002201,45.190512
2021-221223,2021-03-12,000001,Vente,4500,,,LA DEVEZE,B042,15170,15080,Joursac,15,,,15080000ZN0204,,,,,,,,,,,,,0,,,,,S,sols,,,148,3.013401,45.142466
2021-221223,2021-03-12,000001,Vente,4500,,,LA DEVEZE,B042,15170,15080,Joursac,15,,,15080000ZN0236,,,,,,,,,,,,,0,,,,,PA,pâtures,,,8485,3.012555,45.142399
2021-221223,2021-03-12,000001,Vente,4500,,,LA DEVEZE,B042,15170,15080,Joursac,15,,,15080000ZN0239,,,,,,,,,,,,,0,,,,,PA,pâtures,,,136,3.011882,45.142112
2021-221354,2021-03-19,000001,Vente,1500,,,BOIS DE L EGLISE,B010,15170,15080,Joursac,15,,,150800000A0916,,,,,,,,,,,,,0,,,,,BS,taillis sous futaie,,,5310,3.038299,45.174099
2021-221837,2021-05-11,000001,Vente,35000,5125,,PLAMONTEIL,B078,15170,15080,Joursac,15,,,15080000ZA0083,,,,,,,,,,,,,0,1,Maison,60,1,S,sols,,,1316,3.002033,45.190426
2021-222096,2021-05-25,000001,Vente,9000,5105,,LE PEUCH,B073,15170,15080,Joursac,15,,,15080000ZT0020,,,,,,,,,,,,,0,1,Maison,40,1,S,sols,,,160,3.000974,45.172738
2021-222107,2021-05-20,000001,Vente,54000,5102,,RECOULES,B095,15170,15080,Joursac,15,,,15080000ZS0085,,,,,,,,,,,,,0,1,Maison,122,7,S,sols,,,131,3.001032,45.172214
2021-222279,2021-06-16,000001,Vente,22000,5024,,PONT DU VERNET,B081,15170,15080,Joursac,15,,,15080000ZL0049,,,,,,,,,,,,,0,1,Maison,59,1,S,sols,,,580,3.014482,45.140461
2021-222279,2021-06-16,000001,Vente,22000,,,PONT DU VERNET,B081,15170,15080,Joursac,15,,,15080000ZL0054,,,,,,,,,,,,,0,,,,,L,landes,,,60,3.014804,45.140333
2021-222933,2021-08-10,000001,Vente,94500,5052,,LE BOURG,B012,15170,15080,Joursac,15,,,15080000ZN0046,,,,,,,,,,,,,0,1,Maison,60,3,S,sols,,,220,3.00507,45.141887
2021-222933,2021-08-10,000001,Vente,94500,,,LE BOURG,B012,15170,15080,Joursac,15,,,15080000ZN0190,,,,,,,,,,,,,0,,,,,S,sols,,,113,3.005116,45.141681
2021-223133,2021-08-23,000001,Vente,148000,5027,,PONT DU VERNET,B081,15170,15080,Joursac,15,,,15080000ZL0062,,,,,,,,,,,,,0,1,Maison,103,2,S,sols,,,470,3.014536,45.139909
2021-223133,2021-08-23,000001,Vente,148000,,,PONT DU VERNET,B081,15170,15080,Joursac,15,,,15080000ZL0063,,,,,,,,,,,,,0,,,,,L,landes,,,700,3.014466,45.139591
2021-223676,2021-09-28,000001,Vente,1000,,,LE BOURG,B012,15170,15080,Joursac,15,,,15080000ZN0028,,,,,,,,,,,,,0,,,,,S,sols,,,1730,3.003225,45.141137
2021-223756,2021-10-09,000001,Vente,1500,,,LA ROULEYRE,B106,15170,15080,Joursac,15,,,15080000ZK0050,,,,,,,,,,,,,0,,,,,P,prés,,,315,3.013662,45.143475
2021-223756,2021-10-09,000001,Vente,1500,,,LA ROULEYRE,B106,15170,15080,Joursac,15,,,15080000ZK0050,,,,,,,,,,,,,0,,,,,J,jardins,,,225,3.013662,45.143475
2021-224039,2021-10-27,000001,Vente,155000,5029,,PONT DU VERNET,B081,15170,15080,Joursac,15,,,15080000ZL0066,,,,,,,,,,,,,0,1,Maison,112,4,P,prés,,,170,3.014182,45.139344
2021-224039,2021-10-27,000001,Vente,155000,5029,,PONT DU VERNET,B081,15170,15080,Joursac,15,,,15080000ZL0066,,,,,,,,,,,,,0,3,Dépendance,,0,S,sols,,,680,3.014182,45.139344
2021-224039,2021-10-27,000001,Vente,155000,5029,,PONT DU VERNET,B081,15170,15080,Joursac,15,,,15080000ZL0066,,,,,,,,,,,,,0,3,Dépendance,,0,S,sols,,,680,3.014182,45.139344
2021-224039,2021-10-27,000001,Vente,155000,5029,,PONT DU VERNET,B081,15170,15080,Joursac,15,,,15080000ZL0066,,,,,,,,,,,,,0,1,Maison,112,4,S,sols,,,680,3.014182,45.139344
2021-224039,2021-10-27,000001,Vente,155000,5029,,PONT DU VERNET,B081,15170,15080,Joursac,15,,,15080000ZL0066,,,,,,,,,,,,,0,3,Dépendance,,0,P,prés,,,440,3.014182,45.139344
2021-224039,2021-10-27,000001,Vente,155000,5029,,PONT DU VERNET,B081,15170,15080,Joursac,15,,,15080000ZL0066,,,,,,,,,,,,,0,3,Dépendance,,0,P,prés,,,440,3.014182,45.139344
2021-224039,2021-10-27,000001,Vente,155000,5029,,PONT DU VERNET,B081,15170,15080,Joursac,15,,,15080000ZL0066,,,,,,,,,,,,,0,3,Dépendance,,0,P,prés,,,170,3.014182,45.139344
2021-224039,2021-10-27,000001,Vente,155000,5029,,PONT DU VERNET,B081,15170,15080,Joursac,15,,,15080000ZL0066,,,,,,,,,,,,,0,1,Maison,112,4,P,prés,,,440,3.014182,45.139344
2021-224039,2021-10-27,000001,Vente,155000,5029,,PONT DU VERNET,B081,15170,15080,Joursac,15,,,15080000ZL0066,,,,,,,,,,,,,0,3,Dépendance,,0,P,prés,,,170,3.014182,45.139344
2021-224039,2021-10-27,000001,Vente,155000,,,PONT DU VERNET,B081,15170,15080,Joursac,15,,,15080000ZL0067,,,,,,,,,,,,,0,,,,,L,landes,,,620,3.014282,45.139162
2021-224039,2021-10-27,000001,Vente,155000,,,PONT DU VERNET,B081,15170,15080,Joursac,15,,,15080000ZL0068,,,,,,,,,,,,,0,,,,,BT,taillis simples,,,190,3.014049,45.139056
2021-224046,2021-09-07,000001,Vente,200,,,RECOULES,B095,15170,15080,Joursac,15,,,15080000ZS0045,,,,,,,,,,,,,0,,,,,S,sols,,,320,3.000202,45.172015
2021-224665,2021-12-15,000001,Vente,9500,5079,,ELGINES,B043,15170,15080,Joursac,15,,,15080000ZH0039,,,,,,,,,,,,,0,1,Maison,96,2,S,sols,,,280,3.016006,45.16277
2021-224779,2021-12-23,000001,Vente,19200,,,LA BRUGERE,B015,15170,15080,Joursac,15,,,15080000ZB0007,,,,,,,,,,,,,0,,,,,S,sols,,,600,3.02529,45.185475
2021-224779,2021-12-23,000001,Vente,19200,5144,,LA BRUGERE,B015,15170,15080,Joursac,15,,,15080000ZB0010,,,,,,,,,,,,,0,1,Maison,100,1,S,sols,,,510,3.025622,45.185421
2021-224779,2021-12-23,000001,Vente,19200,,,COTE DE SERRE,B036,15170,15080,Joursac,15,,,15080000ZB0052,,,,,,,,,,,,,0,,,,,PA,pâtures,,,200,3.025559,45.185165
