id_mutation,date_mutation,numero_disposition,nature_mutation,valeur_fonciere,adresse_numero,adresse_suffixe,adresse_nom_voie,adresse_code_voie,code_postal,code_commune,nom_commune,code_departement,ancien_code_commune,ancien_nom_commune,id_parcelle,ancien_id_parcelle,numero_volume,lot1_numero,lot1_surface_carrez,lot2_numero,lot2_surface_carrez,lot3_numero,lot3_surface_carrez,lot4_numero,lot4_surface_carrez,lot5_numero,lot5_surface_carrez,nombre_lots,code_type_local,type_local,surface_reelle_bati,nombre_pieces_principales,code_nature_culture,nature_culture,code_nature_culture_speciale,nature_culture_speciale,surface_terrain,longitude,latitude
2021-220671,2021-01-12,000001,Vente,135000,,,LE BOURG,B030,15400,15124,Menet,15,,,15124000AB0032,,,,,,,,,,,,,0,,,,,J,jardins,,,313,2.583896,45.296942
2021-220671,2021-01-12,000001,Vente,135000,5,,RUE DE LA MERCERIE,0285,15400,15124,Menet,15,,,15124000AB0036,,,,,,,,,,,,,0,2,Appartement,65,4,S,sols,,,221,2.584161,45.296952
2021-220671,2021-01-12,000001,Vente,135000,5,,RUE DE LA MERCERIE,0285,15400,15124,Menet,15,,,15124000AB0036,,,,,,,,,,,,,0,3,Dépendance,,0,S,sols,,,221,2.584161,45.296952
2021-220671,2021-01-12,000001,Vente,135000,5,,RUE DE LA MERCERIE,0285,15400,15124,Menet,15,,,15124000AB0036,,,,,,,,,,,,,0,2,Appartement,100,4,S,sols,,,221,2.584161,45.296952
2021-220671,2021-01-12,000001,Vente,135000,5,,RUE DE LA MERCERIE,0285,15400,15124,Menet,15,,,15124000AB0036,,,,,,,,,,,,,0,2,Appartement,75,3,S,sols,,,221,2.584161,45.296952
2021-220768,2021-01-20,000001,Vente,35000,5266,,LES BUGES EST,B040,15400,15124,Menet,15,,,151240000E0235,,,,,,,,,,,,,0,1,Maison,90,5,S,sols,,,2265,2.592365,45.279039
2021-220768,2021-01-20,000001,Vente,35000,,,LES BUGES EST,B040,15400,15124,Menet,15,,,151240000E0545,,,,,,,,,,,,,0,,,,,P,prés,,,2636,2.592722,45.279187
2021-220889,2021-01-29,000002,Vente,1772,,,LAUROLLE,B107,15400,15124,Menet,15,,,151240000E0551,,,,,,,,,,,,,0,,,,,PA,pâtures,,,443,2.593796,45.280489
2021-221094,2021-02-24,000001,Vente,50000,4,,RUE DU COMMERCE,0260,15400,15124,Menet,15,,,15124000AB0389,,,,,,,,,,,,,0,1,Maison,60,3,S,sols,,,495,2.583986,45.296741
2021-221508,2021-03-31,000001,Vente,62000,5295,,ROUDALIAC,B160,15400,15124,Menet,15,,,151240000F0404,,,,,,,,,,,,,0,1,Maison,60,3,S,sols,,,182,2.571565,45.282994
2021-221508,2021-03-31,000001,Vente,62000,,,ROUDALIAC,B160,15400,15124,Menet,15,,,151240000F0405,,,,,,,,,,,,,0,,,,,S,sols,,,51,2.57133,45.282997
2021-221508,2021-03-31,000001,Vente,62000,,,ROUDALIAC,B160,15400,15124,Menet,15,,,151240000F0406,,,,,,,,,,,,,0,,,,,PA,pâtures,,,1217,2.571073,45.28296
2021-221508,2021-03-31,000001,Vente,62000,,,ROUDALIAC,B160,15400,15124,Menet,15,,,151240000F0712,,,,,,,,,,,,,0,,,,,P,prés,,,40,2.571748,45.283016
2021-222209,2021-05-22,000001,Vente,150000,5414,,LA ROUCOULE,B158,15400,15124,Menet,15,,,151240000H0704,,,,,,,,,,,,,0,1,Maison,127,5,S,sols,,,290,2.57204,45.314553
2021-222209,2021-05-22,000001,Vente,150000,,,LA ROUCOULE,B158,15400,15124,Menet,15,,,151240000H0705,,,,,,,,,,,,,0,,,,,J,jardins,,,573,2.57185,45.314399
2021-222209,2021-05-22,000001,Vente,150000,,,LA ROUCOULE,B158,15400,15124,Menet,15,,,151240000H0850,,,,,,,,,,,,,0,,,,,P,prés,,,40,2.572055,45.314606
2021-222209,2021-05-22,000001,Vente,150000,,,LA ROUCOULE,B158,15400,15124,Menet,15,,,151240000H1017,,,,,,,,,,,,,0,,,,,PA,pâtures,,,253,2.571586,45.314319
2021-222209,2021-05-22,000001,Vente,150000,,,LA ROUCOULE,B158,15400,15124,Menet,15,,,151240000H1170,,,,,,,,,,,,,0,,,,,S,sols,,,31,2.572103,45.314471
2021-222213,2021-05-22,000001,Echange,200,,,LA ROUCOULE,B158,15400,15124,Menet,15,,,151240000H0677,,,,,,,,,,,,,0,,,,,J,jardins,,,121,2.573231,45.314166
2021-222213,2021-05-22,000002,Echange,200,,,LA ROUCOULE,B158,15400,15124,Menet,15,,,151240000H0691,,,,,,,,,,,,,0,,,,,J,jardins,,,260,2.573113,45.315112
2021-222213,2021-05-22,000002,Echange,200,,,LA ROUCOULE,B158,15400,15124,Menet,15,,,151240000H1170,,,,,,,,,,,,,0,,,,,S,sols,,,31,2.572103,45.314471
2021-222213,2021-05-22,000003,Echange,200,,,LA ROUCOULE,B158,15400,15124,Menet,15,,,151240000H0672,,,,,,,,,,,,,0,,,,,J,jardins,,,65,2.572596,45.314433
2021-222356,2021-06-04,000001,Vente,29000,5232,,MENOIRE,B114,15400,15124,Menet,15,,,151240000H0197,,,,,,,,,,,,,0,1,Maison,40,2,S,sols,,,199,2.57936,45.2968
2021-222356,2021-06-04,000001,Vente,29000,,,MENOIRE,B114,15400,15124,Menet,15,,,151240000H0222,,,,,,,,,,,,,0,,,,,J,jardins,,,290,2.578846,45.296242
2021-222512,2021-06-14,000001,Vente,68920,4,,RUE DU STADE,0295,15400,15124,Menet,15,,,15124000AB0258,,,,,,,,,,,,,0,1,Maison,92,5,S,sols,,,506,2.581803,45.298171
2021-222528,2021-06-15,000002,Vente,3535,,,MENOIRE,B114,15400,15124,Menet,15,,,151240000H1172,,,,,,,,,,,,,0,,,,,P,prés,,,505,2.579469,45.296655
2021-222566,2021-06-18,000001,Vente,102800,5256,,LAFAGE,B104,15400,15124,Menet,15,,,151240000E0069,,,,,,,,,,,,,0,2,Appartement,63,3,S,sols,,,420,2.596361,45.281223
2021-222566,2021-06-18,000001,Vente,102800,5256,,LAFAGE,B104,15400,15124,Menet,15,,,151240000E0069,,,,,,,,,,,,,0,2,Appartement,63,3,S,sols,,,420,2.596361,45.281223
2021-222566,2021-06-18,000001,Vente,102800,,,LAFAGE,B104,15400,15124,Menet,15,,,151240000E0070,,,,,,,,,,,,,0,,,,,J,jardins,,,722,2.596054,45.2813
2021-222566,2021-06-18,000001,Vente,102800,,,LAFAGE,B104,15400,15124,Menet,15,,,151240000E0071,,,,,,,,,,,,,0,,,,,S,sols,,,15,2.59595,45.281253
2021-222726,2021-07-02,000001,Vente,600,,,SOLEILADOU,B171,15400,15124,Menet,15,,,151240000A0509,,,,,,,,,,,,,0,,,,,J,jardins,,,288,2.59661,45.309559
2021-222756,2021-07-05,000001,Vente,117790,,,PANCHOULY,B119,15400,15124,Menet,15,,,151240000H0084,,,,,,,,,,,,,0,,,,,BT,taillis simples,,,795,2.58861,45.308464
2021-222756,2021-07-05,000001,Vente,117790,,,PANCHOULY,B119,15400,15124,Menet,15,,,151240000H0085,,,,,,,,,,,,,0,,,,,P,prés,,,2020,2.58881,45.307519
2021-222756,2021-07-05,000001,Vente,117790,,,JOUANY,B102,15400,15124,Menet,15,,,151240000H0125,,,,,,,,,,,,,0,,,,,S,sols,,,158,2.588738,45.304688
2021-222756,2021-07-05,000001,Vente,117790,,,LA GRANGEOUNE,B097,15400,15124,Menet,15,,,151240000H0174,,,,,,,,,,,,,0,,,,,PA,pâtures,,,3325,2.587493,45.30249
2021-222756,2021-07-05,000001,Vente,117790,,,LA GRANGEOUNE,B097,15400,15124,Menet,15,,,151240000H0175,,,,,,,,,,,,,0,,,,,PA,pâtures,,,900,2.586742,45.302948
2021-222756,2021-07-05,000001,Vente,117790,,,JOUANY,B102,15400,15124,Menet,15,,,151240000H0908,,,,,,,,,,,,,0,,,,,PA,pâtures,,,36825,2.588907,45.304404
2021-222756,2021-07-05,000001,Vente,117790,,,PANCHOULY,B119,15400,15124,Menet,15,,,151240000H0910,,,,,,,,,,,,,0,,,,,P,prés,,,6749,2.589932,45.30534
2021-222756,2021-07-05,000001,Vente,117790,,,PANCHOULY,B119,15400,15124,Menet,15,,,151240000H0910,,,,,,,,,,,,,0,,,,,P,prés,,,6749,2.589932,45.30534
2021-222756,2021-07-05,000001,Vente,117790,,,JOUANY,B102,15400,15124,Menet,15,,,151240000H0928,,,,,,,,,,,,,0,,,,,PA,pâtures,,,25225,2.588882,45.302277
2021-222757,2021-07-05,000001,Vente,42210,,,LA RAZE,B152,15400,15124,Menet,15,,,151240000H0133,,,,,,,,,,,,,0,,,,,PA,pâtures,,,12030,2.591069,45.301474
2021-222757,2021-07-05,000001,Vente,42210,,,LA RAZE,B152,15400,15124,Menet,15,,,151240000H0133,,,,,,,,,,,,,0,,,,,PA,pâtures,,,12030,2.591069,45.301474
2021-222757,2021-07-05,000001,Vente,42210,,,LA RAZE,B152,15400,15124,Menet,15,,,151240000H0135,,,,,,,,,,,,,0,,,,,PA,pâtures,,,7710,2.592878,45.301458
2021-222757,2021-07-05,000001,Vente,42210,,,LA RAZE,B152,15400,15124,Menet,15,,,151240000H0137,,,,,,,,,,,,,0,,,,,PA,pâtures,,,10440,2.590594,45.299774
2021-222815,2021-07-09,000001,Vente,245000,5419,,LE POUGET,B133,15400,15124,Menet,15,,,151240000G0002,,,,,,,,,,,,,0,3,Dépendance,,0,S,sols,,,860,2.565582,45.31208
2021-222815,2021-07-09,000001,Vente,245000,5419,,LE POUGET,B133,15400,15124,Menet,15,,,151240000G0002,,,,,,,,,,,,,0,3,Dépendance,,0,S,sols,,,860,2.565582,45.31208
2021-222815,2021-07-09,000001,Vente,245000,,,LE POUGET,B133,15400,15124,Menet,15,,,151240000G0004,,,,,,,,,,,,,0,,,,,P,prés,,,4699,2.564411,45.311871
2021-222815,2021-07-09,000001,Vente,245000,5420,,LE POUGET,B133,15400,15124,Menet,15,,,151240000G0005,,,,,,,,,,,,,0,1,Maison,210,7,S,sols,,,972,2.56508,45.311928
2021-222815,2021-07-09,000001,Vente,245000,5420,,LE POUGET,B133,15400,15124,Menet,15,,,151240000G0005,,,,,,,,,,,,,0,1,Maison,41,2,S,sols,,,972,2.56508,45.311928
2021-222815,2021-07-09,000001,Vente,245000,,,PEYRIERE,B124,15400,15124,Menet,15,,,151240000H0627,,,,,,,,,,,,,0,,,,,BR,futaies résineuses,PIN,Pins,500,2.568852,45.310619
2021-223317,2021-08-14,000001,Vente,30000,6003,,LA GRANGEOUNE EST,B098,15400,15124,Menet,15,,,151240000A1194,,,,,,,,,,,,,0,3,Dépendance,,0,PA,pâtures,,,18979,2.617129,45.296843
2021-223317,2021-08-14,000001,Vente,30000,6003,,LA GRANGEOUNE EST,B098,15400,15124,Menet,15,,,151240000A1194,,,,,,,,,,,,,0,3,Dépendance,,0,PA,pâtures,,,18979,2.617129,45.296843
2021-223317,2021-08-14,000001,Vente,30000,6003,,LA GRANGEOUNE EST,B098,15400,15124,Menet,15,,,151240000A1194,,,,,,,,,,,,,0,3,Dépendance,,0,S,sols,,,551,2.617129,45.296843
2021-223317,2021-08-14,000001,Vente,30000,6003,,LA GRANGEOUNE EST,B098,15400,15124,Menet,15,,,151240000A1194,,,,,,,,,,,,,0,3,Dépendance,,0,S,sols,,,551,2.617129,45.296843
2021-223447,2021-08-25,000002,Vente,20000,,,ROUDALIAC,B160,15400,15124,Menet,15,,,151240000F0389,,,,,,,,,,,,,0,,,,,S,sols,,,311,2.572636,45.284092
2021-223447,2021-08-25,000002,Vente,20000,,,ROUDALIAC,B160,15400,15124,Menet,15,,,151240000F0820,,,,,,,,,,,,,0,,,,,P,prés,,,2383,2.57253,45.284412
2021-223753,2021-09-27,000001,Vente,290000,6065,,LES PLANCHETTES,B129,15400,15124,Menet,15,,,151240000A0528,,,,,,,,,,,,,0,1,Maison,170,5,PA,pâtures,,,3410,2.600724,45.313404
2021-223753,2021-09-27,000001,Vente,290000,6065,,LES PLANCHETTES,B129,15400,15124,Menet,15,,,151240000A0528,,,,,,,,,,,,,0,1,Maison,170,5,S,sols,,,1000,2.600724,45.313404
2021-223753,2021-09-27,000001,Vente,290000,,,LES PLANCHETTES,B129,15400,15124,Menet,15,,,151240000A0530,,,,,,,,,,,,,0,,,,,PA,pâtures,,,4840,2.600211,45.312827
2021-223760,2021-09-30,000001,Vente,140000,,,BOIS DU SAMBARD,B022,15400,15124,Menet,15,,,151240000A0120,,,,,,,,,,,,,0,,,,,BT,taillis simples,,,5960,2.609485,45.319294
2021-223760,2021-09-30,000001,Vente,140000,5067,,FAJIDE,B086,15400,15124,Menet,15,,,151240000A1125,,,,,,,,,,,,,0,3,Dépendance,,0,S,sols,,,579,2.604301,45.295072
2021-223760,2021-09-30,000001,Vente,140000,5067,,FAJIDE,B086,15400,15124,Menet,15,,,151240000A1125,,,,,,,,,,,,,0,1,Maison,125,6,S,sols,,,579,2.604301,45.295072
2021-223760,2021-09-30,000001,Vente,140000,,,MONTSISTRIER,B116,15400,15124,Menet,15,,,151240000A1126,,,,,,,,,,,,,0,,,,,J,jardins,,,67,2.604527,45.294875
2021-223760,2021-09-30,000001,Vente,140000,,,MONTSISTRIER,B116,15400,15124,Menet,15,,,151240000A1127,,,,,,,,,,,,,0,,,,,J,jardins,,,163,2.604593,45.294818
2021-223760,2021-09-30,000001,Vente,140000,,,BOIS DE LA BECHE,B014,15400,15124,Menet,15,,,151240000A1321,,,,,,,,,,,,,0,,,,,BT,taillis simples,,,1757,2.597898,45.29236
2021-223760,2021-09-30,000001,Vente,140000,,,FAJIDE,B086,15400,15124,Menet,15,,,151240000A1694,,,,,,,,,,,,,0,,,,,PA,pâtures,,,2430,2.604029,45.294929
2021-223760,2021-09-30,000001,Vente,140000,,,FAJIDE,B086,15400,15124,Menet,15,,,151240000A1694,,,,,,,,,,,,,0,,,,,P,prés,,,810,2.604029,45.294929
2021-223760,2021-09-30,000001,Vente,140000,,,BOIS DE LA BECHE,B014,15400,15124,Menet,15,,,151240000A1864,,,,,,,,,,,,,0,,,,,BS,taillis sous futaie,,,2528,2.597091,45.293377
2021-223760,2021-09-30,000001,Vente,140000,,,BOIS DE LA BECHE,B014,15400,15124,Menet,15,,,151240000A1874,,,,,,,,,,,,,0,,,,,PA,pâtures,,,4541,2.600206,45.292542
2021-223760,2021-09-30,000001,Vente,140000,,,MONTSISTRIER,B116,15400,15124,Menet,15,,,151240000A1905,,,,,,,,,,,,,0,,,,,P,prés,,,1593,,
2021-223760,2021-09-30,000001,Vente,140000,,,MONTSISTRIER,B116,15400,15124,Menet,15,,,151240000A1906,,,,,,,,,,,,,0,,,,,L,landes,,,60,,
2021-223850,2021-09-25,000001,Vente,148000,18,,RUE DE L EGLISE,0270,15400,15124,Menet,15,,,15124000AB0174,,,,,,,,,,,,,0,2,Appartement,70,3,S,sols,,,126,2.585182,45.296037
2021-223850,2021-09-25,000001,Vente,148000,18,,RUE DE L EGLISE,0270,15400,15124,Menet,15,,,15124000AB0174,,,,,,,,,,,,,0,2,Appartement,50,2,S,sols,,,126,2.585182,45.296037
2021-223850,2021-09-25,000001,Vente,148000,18,,RUE DE L EGLISE,0270,15400,15124,Menet,15,,,15124000AB0174,,,,,,,,,,,,,0,3,Dépendance,,0,S,sols,,,126,2.585182,45.296037
2021-223960,2021-10-07,000001,Vente,68400,21,,RUE DU STADE,0295,15400,15124,Menet,15,,,15124000AB0324,,,,,,,,,,,,,0,1,Maison,80,4,S,sols,,,394,2.581835,45.297544
2021-224003,2021-10-15,000001,Vente,370,,,BOIS GRAND,B023,15400,15124,Menet,15,,,151240000H0821,,,,,,,,,,,,,0,,,,,BT,taillis simples,,,2480,2.579108,45.320502
2021-224263,2021-11-02,000001,Vente,37100,5288,,ROUDALIAC,B160,15400,15124,Menet,15,,,151240000F0392,,,,,,,,,,,,,0,3,Dépendance,,0,S,sols,,,373,2.572029,45.284093
2021-224263,2021-11-02,000001,Vente,37100,5288,,ROUDALIAC,B160,15400,15124,Menet,15,,,151240000F0392,,,,,,,,,,,,,0,1,Maison,40,1,S,sols,,,373,2.572029,45.284093
2021-224263,2021-11-02,000001,Vente,37100,5298,,ROUDALIAC,B160,15400,15124,Menet,15,,,151240000F0754,,,,,,,,,,,,,0,1,Maison,50,1,S,sols,,,87,2.571395,45.283505
2021-224263,2021-11-02,000001,Vente,37100,,,ROUDALIAC,B160,15400,15124,Menet,15,,,151240000F0819,,,,,,,,,,,,,0,,,,,P,prés,,,1770,2.572025,45.28429
2021-224303,2021-11-19,000001,Vente,136000,8,,RUE DU LAC,0275,15400,15124,Menet,15,,,15124000AB0099,,,,,,,,,,,,,0,1,Maison,140,7,S,sols,,,574,2.585413,45.297804
2021-224303,2021-11-19,000001,Vente,136000,,,LE BOURG,B030,15400,15124,Menet,15,,,15124000AB0100,,,,,,,,,,,,,0,,,,,P,prés,,,983,2.585265,45.297634
2021-224332,2021-11-10,000001,Vente,20000,,,BROCQ SUD,B033,15400,15124,Menet,15,,,151240000F0318,,,,,,,,,,,,,0,,,,,PA,pâtures,,,100,2.546242,45.291964
2021-224332,2021-11-10,000001,Vente,20000,,,BROCQ,B032,15400,15124,Menet,15,,,151240000G0322,,,,,,,,,,,,,0,,,,,S,sols,,,250,2.546205,45.292145
2021-224332,2021-11-10,000001,Vente,20000,5348,,BROCQ,B032,15400,15124,Menet,15,,,151240000G0323,,,,,,,,,,,,,0,1,Maison,30,0,S,sols,,,90,2.546084,45.292027
2021-224332,2021-11-10,000001,Vente,20000,,,BROCQ,B032,15400,15124,Menet,15,,,151240000G0326,,,,,,,,,,,,,0,,,,,J,jardins,,,242,2.54603,45.292195
2021-224334,2021-11-09,000001,Vente,115000,,,LA CHAMPS DU BOIS,B045,15400,15124,Menet,15,,,151240000A1695,,,,,,,,,,,,,0,,,,,S,sols,,,40,2.601439,45.293627
2021-224334,2021-11-09,000001,Vente,115000,6024,,LA CHAMPS DU BOIS,B045,15400,15124,Menet,15,,,151240000A1698,,,,,,,,,,,,,0,1,Maison,99,5,S,sols,,,960,2.601351,45.293541
2021-224477,2021-11-19,000001,Vente,5000,,,ROCHE BLANCHE,B155,15400,15124,Menet,15,,,151240000A1847,,,,,,,,,,,,,0,,,,,BT,taillis simples,,,5302,2.608655,45.291907
2021-224486,2021-11-20,000001,Vente,131369,3,,QUARTIER DES FRAYSSES,0310,15400,15124,Menet,15,,,151240000H1047,,,,,,,,,,,,,0,1,Maison,162,4,S,sols,,,954,2.58044,45.299374
2021-224488,2021-11-20,000001,Vente,27500,6000,,ROUDADOU,B159,15400,15124,Menet,15,,,151240000H0860,,,,,,,,,,,,,0,1,Maison,68,3,S,sols,,,903,2.570746,45.30746
2021-224488,2021-11-20,000001,Vente,27500,,,ROUDADOU,B159,15400,15124,Menet,15,,,151240000H0862,,,,,,,,,,,,,0,,,,,PA,pâtures,,,66,2.570915,45.307598
2021-224488,2021-11-20,000001,Vente,27500,,,ROUDADOU,B159,15400,15124,Menet,15,,,151240000H0863,,,,,,,,,,,,,0,,,,,PA,pâtures,,,199,2.570566,45.30748
2021-224500,2021-11-22,000001,Vente,161500,6,,RUE DES CARRIERS,0255,15400,15124,Menet,15,,,15124000AB0057,,,,,,,,,,,,,0,1,Maison,147,3,S,sols,,,480,2.583489,45.297975
2021-224814,2021-12-20,000002,Vente,46000,,,LES CHASSAGNOLLES,B050,15400,15124,Menet,15,,,151240000H0771,,,,,,,,,,,,,0,,,,,S,sols,,,166,2.576506,45.315639
2021-224814,2021-12-20,000002,Vente,46000,,,COSTES,B067,15400,15124,Menet,15,,,151240000H0799,,,,,,,,,,,,,0,,,,,BT,taillis simples,,,8962,2.579055,45.313369
2021-224814,2021-12-20,000002,Vente,46000,,,COSTES,B067,15400,15124,Menet,15,,,151240000H0799,,,,,,,,,,,,,0,,,,,BR,futaies résineuses,PIN,Pins,2988,2.579055,45.313369
2021-224814,2021-12-20,000002,Vente,46000,,,COSTES,B067,15400,15124,Menet,15,,,151240000H0800,,,,,,,,,,,,,0,,,,,L,landes,,,3850,2.578978,45.312946
2021-224816,2021-12-20,000001,Vente,150000,5159,,LE BOURG,B030,15400,15124,Menet,15,,,15124000AB0120,,,,,,,,,,,,,0,1,Maison,220,7,S,sols,,,867,2.585771,45.296496
2021-224896,2021-12-23,000002,Vente,10000,,,LISSARTADIER,B111,15400,15124,Menet,15,,,151240000F0723,,,,,,,,,,,,,0,,,,,S,sols,,,179,2.563812,45.276115
