id_mutation,date_mutation,numero_disposition,nature_mutation,valeur_fonciere,adresse_numero,adresse_suffixe,adresse_nom_voie,adresse_code_voie,code_postal,code_commune,nom_commune,code_departement,ancien_code_commune,ancien_nom_commune,id_parcelle,ancien_id_parcelle,numero_volume,lot1_numero,lot1_surface_carrez,lot2_numero,lot2_surface_carrez,lot3_numero,lot3_surface_carrez,lot4_numero,lot4_surface_carrez,lot5_numero,lot5_surface_carrez,nombre_lots,code_type_local,type_local,surface_reelle_bati,nombre_pieces_principales,code_nature_culture,nature_culture,code_nature_culture_speciale,nature_culture_speciale,surface_terrain,longitude,latitude
2021-220905,2021-02-03,000002,Vente,26000,,,LAPRADE,B025,15590,15178,Saint-Cirgues-de-Jordanne,15,,,151780000B0281,,,,,,,,,,,,,0,,,,,J,jardins,,,120,2.595147,45.026164
2021-220905,2021-02-03,000002,Vente,26000,7,,RUE DU BANCAREL,0105,15590,15178,Saint-Cirgues-de-Jordanne,15,,,151780000B0282,,,,,,,,,,,,,0,1,Maison,70,4,S,sols,,,80,2.594907,45.026304
2021-220905,2021-02-03,000002,Vente,26000,,,LAPRADE,B025,15590,15178,Saint-Cirgues-de-Jordanne,15,,,151780000B0679,,,,,,,,,,,,,0,,,,,S,sols,,,11,2.594845,45.026297
2021-220905,2021-02-03,000003,Vente,26000,,,LAPRADE,B025,15590,15178,Saint-Cirgues-de-Jordanne,15,,,151780000B0281,,,,,,,,,,,,,0,,,,,J,jardins,,,120,2.595147,45.026164
2021-220905,2021-02-03,000003,Vente,26000,7,,RUE DU BANCAREL,0105,15590,15178,Saint-Cirgues-de-Jordanne,15,,,151780000B0282,,,,,,,,,,,,,0,1,Maison,70,4,S,sols,,,80,2.594907,45.026304
2021-220905,2021-02-03,000003,Vente,26000,,,LAPRADE,B025,15590,15178,Saint-Cirgues-de-Jordanne,15,,,151780000B0679,,,,,,,,,,,,,0,,,,,S,sols,,,11,2.594845,45.026297
2021-220905,2021-02-03,000003,Vente,26000,,,LAPRADE,B025,15590,15178,Saint-Cirgues-de-Jordanne,15,,,151780000B0680,,,,,,,,,,,,,0,,,,,S,sols,,,53,2.59484,45.026373
2021-222788,2021-07-03,000001,Vente,795,,,LE POUGET,B039,15590,15178,Saint-Cirgues-de-Jordanne,15,,,151780000B0423,,,,,,,,,,,,,0,,,,,P,prés,,,705,2.59476,45.022054
2021-222788,2021-07-03,000001,Vente,795,,,LE POUGET,B039,15590,15178,Saint-Cirgues-de-Jordanne,15,,,151780000B0425,,,,,,,,,,,,,0,,,,,P,prés,,,4840,2.593897,45.02286
2021-223333,2021-08-27,000001,Vente,181000,4,,RUE DU BOUSCATEL,0115,15590,15178,Saint-Cirgues-de-Jordanne,15,,,151780000C0073,,,,,,,,,,,,,0,1,Maison,88,5,S,sols,,,1020,2.598511,45.033738
2021-223333,2021-08-27,000001,Vente,181000,,,LE CHAUMEIL,B010,15590,15178,Saint-Cirgues-de-Jordanne,15,,,151780000C0116,,,,,,,,,,,,,0,,,,,J,jardins,,,265,2.598892,45.033356
2021-223333,2021-08-27,000001,Vente,181000,,,LE CHAUMEIL,B010,15590,15178,Saint-Cirgues-de-Jordanne,15,,,151780000C0117,,,,,,,,,,,,,0,,,,,P,prés,,,1097,2.598785,45.033516
2021-223333,2021-08-27,000001,Vente,181000,,,LE CHAUMEIL,B010,15590,15178,Saint-Cirgues-de-Jordanne,15,,,151780000C0118,,,,,,,,,,,,,0,,,,,PA,pâtures,,,3895,2.598169,45.033296
2021-223333,2021-08-27,000001,Vente,181000,,,LE CHAUMEIL,B010,15590,15178,Saint-Cirgues-de-Jordanne,15,,,151780000C0118,,,,,,,,,,,,,0,,,,,PA,pâtures,,,3895,2.598169,45.033296
2021-223333,2021-08-27,000001,Vente,181000,,,LE CHAUMEIL,B010,15590,15178,Saint-Cirgues-de-Jordanne,15,,,151780000C0357,,,,,,,,,,,,,0,,,,,J,jardins,,,88,2.59884,45.033756
2021-223333,2021-08-27,000001,Vente,181000,,,LE CHAUMEIL,B010,15590,15178,Saint-Cirgues-de-Jordanne,15,,,151780000C0552,,,,,,,,,,,,,0,,,,,J,jardins,,,121,2.598966,45.033754
2021-223333,2021-08-27,000001,Vente,181000,,,LE CHAUMEIL,B010,15590,15178,Saint-Cirgues-de-Jordanne,15,,,151780000C0555,,,,,,,,,,,,,0,,,,,P,prés,,,4891,2.597526,45.033877
2021-223333,2021-08-27,000001,Vente,181000,,,LE CHAUMEIL,B010,15590,15178,Saint-Cirgues-de-Jordanne,15,,,151780000C0555,,,,,,,,,,,,,0,,,,,P,prés,,,4892,2.597526,45.033877
