id_mutation,date_mutation,numero_disposition,nature_mutation,valeur_fonciere,adresse_numero,adresse_suffixe,adresse_nom_voie,adresse_code_voie,code_postal,code_commune,nom_commune,code_departement,ancien_code_commune,ancien_nom_commune,id_parcelle,ancien_id_parcelle,numero_volume,lot1_numero,lot1_surface_carrez,lot2_numero,lot2_surface_carrez,lot3_numero,lot3_surface_carrez,lot4_numero,lot4_surface_carrez,lot5_numero,lot5_surface_carrez,nombre_lots,code_type_local,type_local,surface_reelle_bati,nombre_pieces_principales,code_nature_culture,nature_culture,code_nature_culture_speciale,nature_culture_speciale,surface_terrain,longitude,latitude
2021-220627,2021-01-08,000001,Vente,75000,6,,RUE DU LAVOIR,0070,15240,15250,Vebret,15,,,15250000ZK0072,,,,,,,,,,,,,0,1,Maison,84,4,S,sols,,,900,2.521801,45.345615
2021-220627,2021-01-08,000001,Vente,75000,6,,RUE DU LAVOIR,0070,15240,15250,Vebret,15,,,15250000ZK0072,,,,,,,,,,,,,0,3,Dépendance,,0,S,sols,,,900,2.521801,45.345615
2021-220735,2021-01-29,000001,Vente,71250,9,,RUE SAINT LOUIS,0105,15240,15250,Vebret,15,,,15250000ZM0030,,,,,,,,,,,,,0,1,Maison,150,5,S,sols,,,650,2.519781,45.340429
2021-220850,2021-01-28,000001,Vente,50000,11,,RUE SAINT LOUIS,0105,15240,15250,Vebret,15,,,15250000ZM0029,,,,,,,,,,,,,0,1,Maison,72,4,S,sols,,,440,2.519788,45.340606
2021-220850,2021-01-28,000001,Vente,50000,11,,RUE SAINT LOUIS,0105,15240,15250,Vebret,15,,,15250000ZM0029,,,,,,,,,,,,,0,3,Dépendance,,0,S,sols,,,440,2.519788,45.340606
2021-220850,2021-01-28,000001,Vente,50000,,,LE BOURG,B022,15240,15250,Vebret,15,,,15250000ZM0106,,,,,,,,,,,,,0,,,,,P,prés,,,40,2.519947,45.340664
2021-221127,2021-03-05,000001,Vente,4000,,,GRANGE NEUVE,B066,15240,15250,Vebret,15,,,15250000ZN0066,,,,,,,,,,,,,0,,,,,L,landes,,,1350,2.528664,45.322055
2021-221127,2021-03-05,000001,Vente,4000,,,PRUNET BAS,B105,15240,15250,Vebret,15,,,15250000ZN0105,,,,,,,,,,,,,0,,,,,P,prés,,,1851,2.532122,45.326431
2021-221127,2021-03-05,000001,Vente,4000,,,PRUNET BAS,B105,15240,15250,Vebret,15,,,15250000ZN0105,,,,,,,,,,,,,0,,,,,J,jardins,,,1663,2.532122,45.326431
2021-221300,2021-03-16,000002,Vente,55000,10,,MONTPIGOT,B082,15240,15250,Vebret,15,,,15250000ZI0146,,,,,,,,,,,,,0,1,Maison,81,5,,,,,,2.519581,45.352171
2021-221309,2021-03-15,000001,Vente,135700,6,,LES CHAMPAGNADOUX,B141,15240,15250,Vebret,15,,,15250000ZK0141,,,,,,,,,,,,,0,1,Maison,83,5,S,sols,,,500,2.509513,45.346789
2021-221309,2021-03-15,000001,Vente,135700,6,,LES CHAMPAGNADOUX,B141,15240,15250,Vebret,15,,,15250000ZK0141,,,,,,,,,,,,,0,1,Maison,83,5,J,jardins,,,576,2.509513,45.346789
2021-221940,2021-05-04,000001,Vente,73000,3,,VERCHALLES SOUBRO,B133,15240,15250,Vebret,15,,,15250000ZT0031,,,,,,,,,,,,,0,1,Maison,130,4,J,jardins,,,415,2.493823,45.362078
2021-221940,2021-05-04,000001,Vente,73000,3,,VERCHALLES SOUBRO,B133,15240,15250,Vebret,15,,,15250000ZT0031,,,,,,,,,,,,,0,1,Maison,55,2,P,prés,,,1741,2.493823,45.362078
2021-221940,2021-05-04,000001,Vente,73000,3,,VERCHALLES SOUBRO,B133,15240,15250,Vebret,15,,,15250000ZT0031,,,,,,,,,,,,,0,1,Maison,130,4,S,sols,,,414,2.493823,45.362078
2021-221940,2021-05-04,000001,Vente,73000,3,,VERCHALLES SOUBRO,B133,15240,15250,Vebret,15,,,15250000ZT0031,,,,,,,,,,,,,0,1,Maison,55,2,S,sols,,,414,2.493823,45.362078
2021-221940,2021-05-04,000001,Vente,73000,3,,VERCHALLES SOUBRO,B133,15240,15250,Vebret,15,,,15250000ZT0031,,,,,,,,,,,,,0,1,Maison,130,4,P,prés,,,1741,2.493823,45.362078
2021-221940,2021-05-04,000001,Vente,73000,3,,VERCHALLES SOUBRO,B133,15240,15250,Vebret,15,,,15250000ZT0031,,,,,,,,,,,,,0,1,Maison,55,2,J,jardins,,,415,2.493823,45.362078
2021-221940,2021-05-04,000001,Vente,73000,5257,,VERCHALLES SOUBRO,B133,15240,15250,Vebret,15,,,15250000ZT0049,,,,,,,,,,,,,0,3,Dépendance,,0,S,sols,,,47,2.493624,45.362574
2021-221941,2021-05-04,000001,Vente,500,,,VERCHALLES SOUBRO,B133,15240,15250,Vebret,15,,,15250000ZT0029,,,,,,,,,,,,,0,,,,,P,prés,,,500,2.494272,45.362118
2021-222275,2021-05-31,000001,Vente,10465,,,MONTPIGOT,B082,15240,15250,Vebret,15,,,15250000ZI0133,,,,,,,,,,,,,0,,,,,P,prés,,,1531,2.518889,45.352721
2021-222275,2021-05-31,000001,Vente,10465,,,MONTPIGOT,B082,15240,15250,Vebret,15,,,15250000ZI0134,,,,,,,,,,,,,0,,,,,P,prés,,,1459,2.519187,45.35243
2021-222606,2021-06-19,000001,Vente,4000,,,BRUYERES DE LA ROCHE GRAND,B024,15240,15250,Vebret,15,,,152500000A0463,,,,,,,,,,,,,0,,,,,L,landes,,,990,2.521279,45.375457
2021-222606,2021-06-19,000001,Vente,4000,,,BRUYERES DE LA ROCHE GRAND,B024,15240,15250,Vebret,15,,,152500000A0465,,,,,,,,,,,,,0,,,,,BT,taillis simples,,,4030,2.521324,45.375264
2021-222606,2021-06-19,000001,Vente,4000,,,BRUYERES DE LA ROCHE GRAND,B024,15240,15250,Vebret,15,,,152500000A0466,,,,,,,,,,,,,0,,,,,L,landes,,,2250,2.52142,45.374836
2021-222606,2021-06-19,000001,Vente,4000,,,LES BOIS GABRIEL,B020,15240,15250,Vebret,15,,,152500000A0631,,,,,,,,,,,,,0,,,,,BT,taillis simples,,,30320,2.517097,45.372326
2021-222610,2021-06-25,000001,Vente,4000,,,LES BOCANS,B011,15240,15250,Vebret,15,,,152500000B0525,,,,,,,,,,,,,0,,,,,P,prés,,,3330,2.533059,45.351122
2021-222610,2021-06-25,000001,Vente,4000,,,LES BOCANS,B011,15240,15250,Vebret,15,,,152500000B0530,,,,,,,,,,,,,0,,,,,BT,taillis simples,,,6120,2.534976,45.350186
2021-222610,2021-06-25,000001,Vente,4000,,,LES BOCANS,B011,15240,15250,Vebret,15,,,152500000B0531,,,,,,,,,,,,,0,,,,,BT,taillis simples,,,38680,2.533474,45.349765
2021-222611,2021-06-25,000001,Vente,2000,,,LA COSTE,B046,15240,15250,Vebret,15,,,15250000ZH0020,,,,,,,,,,,,,0,,,,,BR,futaies résineuses,PIN,Pins,3720,2.531326,45.358742
2021-222611,2021-06-25,000001,Vente,2000,,,LACHAMP,B070,15240,15250,Vebret,15,,,15250000ZH0059,,,,,,,,,,,,,0,,,,,P,prés,,,5120,2.531845,45.357534
2021-222611,2021-06-25,000001,Vente,2000,,,LACHAMP,B070,15240,15250,Vebret,15,,,15250000ZH0059,,,,,,,,,,,,,0,,,,,BT,taillis simples,,,3815,2.531845,45.357534
2021-222611,2021-06-25,000001,Vente,2000,,,LACHAMP,B070,15240,15250,Vebret,15,,,15250000ZH0059,,,,,,,,,,,,,0,,,,,BS,taillis sous futaie,,,10162,2.531845,45.357534
2021-222712,2021-07-01,000001,Vente,23500,5,,VERCHALLES SOUTRO,B134,15240,15250,Vebret,15,,,15250000ZT0040,,,,,,,,,,,,,0,1,Maison,55,1,S,sols,,,209,2.500786,45.36277
2021-222821,2021-07-21,000001,Vente,50000,1,,RUE DES BOURNIOUX,0020,15240,15250,Vebret,15,,,15250000ZM0048,,,,,,,,,,,,,0,1,Maison,70,4,S,sols,,,500,2.518834,45.338319
2021-223174,2021-08-12,000001,Vente,126120,3,,CHAMPASSIS,B029,15240,15250,Vebret,15,,,15250000ZI0118,,,,,,,,,,,,,0,1,Maison,80,2,S,sols,,,1027,2.50817,45.349611
2021-223385,2021-08-20,000001,Vente,80000,3,,CHE DE LA RESERVE,0100,15240,15250,Vebret,15,,,152500000B1605,,,,,,,,,,,,,0,3,Dépendance,,0,L,landes,,,484,2.513227,45.365822
2021-223385,2021-08-20,000001,Vente,80000,3,,CHE DE LA RESERVE,0100,15240,15250,Vebret,15,,,152500000B1605,,,,,,,,,,,,,0,3,Dépendance,,0,S,sols,,,36,2.513227,45.365822
2021-223385,2021-08-20,000001,Vente,80000,,,PYROUSE,B108,15240,15250,Vebret,15,,,152500000B1610,,,,,,,,,,,,,0,,,,,T,terres,,,182,2.513239,45.365521
2021-223385,2021-08-20,000001,Vente,80000,1,,IMP PYROUSE,0095,15240,15250,Vebret,15,,,152500000B1613,,,,,,,,,,,,,0,1,Maison,70,5,L,landes,,,488,2.513029,45.36558
2021-223385,2021-08-20,000001,Vente,80000,1,,IMP PYROUSE,0095,15240,15250,Vebret,15,,,152500000B1613,,,,,,,,,,,,,0,1,Maison,70,5,S,sols,,,595,2.513029,45.36558
2021-223451,2021-08-26,000001,Vente,158900,2,,RUE SAINT LOUIS,0105,15240,15250,Vebret,15,,,15250000ZM0118,,,,,,,,,,,,,0,2,Appartement,110,4,S,sols,,,453,2.522026,45.338521
2021-223451,2021-08-26,000001,Vente,158900,2,,RUE SAINT LOUIS,0105,15240,15250,Vebret,15,,,15250000ZM0118,,,,,,,,,,,,,0,3,Dépendance,,0,S,sols,,,453,2.522026,45.338521
2021-223451,2021-08-26,000001,Vente,158900,2,,RUE SAINT LOUIS,0105,15240,15250,Vebret,15,,,15250000ZM0118,,,,,,,,,,,,,0,3,Dépendance,,0,S,sols,,,453,2.522026,45.338521
2021-223451,2021-08-26,000001,Vente,158900,2,,RUE SAINT LOUIS,0105,15240,15250,Vebret,15,,,15250000ZM0118,,,,,,,,,,,,,0,3,Dépendance,,0,S,sols,,,453,2.522026,45.338521
2021-223451,2021-08-26,000001,Vente,158900,2,,RUE SAINT LOUIS,0105,15240,15250,Vebret,15,,,15250000ZM0118,,,,,,,,,,,,,0,2,Appartement,90,3,S,sols,,,453,2.522026,45.338521
2021-223451,2021-08-26,000001,Vente,158900,2,,RUE SAINT LOUIS,0105,15240,15250,Vebret,15,,,15250000ZM0118,,,,,,,,,,,,,0,3,Dépendance,,0,S,sols,,,453,2.522026,45.338521
2021-223451,2021-08-26,000001,Vente,158900,2,,RUE SAINT LOUIS,0105,15240,15250,Vebret,15,,,15250000ZM0118,,,,,,,,,,,,,0,3,Dépendance,,0,S,sols,,,453,2.522026,45.338521
2021-223451,2021-08-26,000001,Vente,158900,,,LE BOURG,B022,15240,15250,Vebret,15,,,15250000ZM0120,,,,,,,,,,,,,0,,,,,P,prés,,,735,2.521778,45.338642
2021-223451,2021-08-26,000001,Vente,158900,,,LE BOURG,B022,15240,15250,Vebret,15,,,15250000ZM0120,,,,,,,,,,,,,0,,,,,P,prés,,,735,2.521778,45.338642
2021-224772,2021-12-23,000001,Vente,73000,1,,RTE DE CHAMPS SUR TARENTAINE,0030,15240,15250,Vebret,15,,,15250000ZB0031,,,,,,,,,,,,,0,1,Maison,64,5,S,sols,,,418,2.513513,45.367471
2021-224772,2021-12-23,000001,Vente,73000,1,,RTE DE CHAMPS SUR TARENTAINE,0030,15240,15250,Vebret,15,,,15250000ZB0031,,,,,,,,,,,,,0,1,Maison,64,5,J,jardins,,,2002,2.513513,45.367471
