id_mutation,date_mutation,numero_disposition,nature_mutation,valeur_fonciere,adresse_numero,adresse_suffixe,adresse_nom_voie,adresse_code_voie,code_postal,code_commune,nom_commune,code_departement,ancien_code_commune,ancien_nom_commune,id_parcelle,ancien_id_parcelle,numero_volume,lot1_numero,lot1_surface_carrez,lot2_numero,lot2_surface_carrez,lot3_numero,lot3_surface_carrez,lot4_numero,lot4_surface_carrez,lot5_numero,lot5_surface_carrez,nombre_lots,code_type_local,type_local,surface_reelle_bati,nombre_pieces_principales,code_nature_culture,nature_culture,code_nature_culture_speciale,nature_culture_speciale,surface_terrain,longitude,latitude
2021-225852,2021-02-12,000001,Vente,98185,,,CHEZ DOUBLET,B035,16480,16040,Berneuil,16,,,160400000C0120,,,,,,,,,,,,,0,,,,,S,sols,,,755,-0.069676,45.402181
2021-225852,2021-02-12,000001,Vente,98185,5127,,CHEZ DOUBLET,B035,16480,16040,Berneuil,16,,,160400000C1057,,,,,,,,,,,,,0,1,Maison,50,3,S,sols,,,50,-0.069702,45.402217
2021-225852,2021-02-12,000001,Vente,98185,,,COTEAU DOUBLET,B060,16480,16040,Berneuil,16,,,16040000ZR0134,,,,,,,,,,,,,0,,,,,T,terres,,,2528,-0.069638,45.402292
2021-226184,2021-02-24,000001,Vente,130000,350,,RTE DE CHALLIGNAC,0200,16480,16040,Berneuil,16,,,16040000ZR0102,,,,,,,,,,,,,0,1,Maison,21,2,AG,terrains d'agrément,,,2000,-0.076062,45.396031
2021-226184,2021-02-24,000001,Vente,130000,350,,RTE DE CHALLIGNAC,0200,16480,16040,Berneuil,16,,,16040000ZR0102,,,,,,,,,,,,,0,1,Maison,90,3,S,sols,,,2000,-0.076062,45.396031
2021-226184,2021-02-24,000001,Vente,130000,350,,RTE DE CHALLIGNAC,0200,16480,16040,Berneuil,16,,,16040000ZR0102,,,,,,,,,,,,,0,1,Maison,21,2,S,sols,,,2000,-0.076062,45.396031
2021-226184,2021-02-24,000001,Vente,130000,350,,RTE DE CHALLIGNAC,0200,16480,16040,Berneuil,16,,,16040000ZR0102,,,,,,,,,,,,,0,1,Maison,90,3,AG,terrains d'agrément,,,2000,-0.076062,45.396031
2021-226184,2021-02-24,000001,Vente,130000,,,PRES BUREAU OUEST,B117,16480,16040,Berneuil,16,,,16040000ZR0104,,,,,,,,,,,,,0,,,,,AG,terrains d'agrément,,,830,-0.07583,45.396115
2021-226184,2021-02-24,000001,Vente,130000,,,PRES BUREAU OUEST,B117,16480,16040,Berneuil,16,,,16040000ZR0104,,,,,,,,,,,,,0,,,,,S,sols,,,830,-0.07583,45.396115
2021-226317,2021-02-10,000001,Vente,5702.13,,,BOIS JOURNAUX,B014,16480,16040,Berneuil,16,,,16040000ZL0062,,,,,,,,,,,,,0,,,,,BP,peupleraies,,,1108,-0.060766,45.390744
2021-226317,2021-02-10,000001,Vente,5702.13,,,BOIS JOURNAUX,B014,16480,16040,Berneuil,16,,,16040000ZL0064,,,,,,,,,,,,,0,,,,,BP,peupleraies,,,3433,-0.060419,45.390271
2021-226317,2021-02-10,000001,Vente,5702.13,,,BOIS JOURNAUX,B014,16480,16040,Berneuil,16,,,16040000ZL0067,,,,,,,,,,,,,0,,,,,BP,peupleraies,,,22612,-0.060292,45.388557
2021-227908,2021-04-10,000002,Vente,3000,,,PRES BUREAU OUEST,B117,16480,16040,Berneuil,16,,,16040000ZR0160,,,,,,,,,,,,,0,,,,,T,terres,,,7407,-0.075147,45.395384
2021-229475,2021-06-03,000001,Vente,9800,,,PRES BUREAU OUEST,B117,16480,16040,Berneuil,16,,,16040000ZR0112,,,,,,,,,,,,,0,,,,,T,terres,,,1997,-0.075748,45.396908
2021-229475,2021-06-03,000001,Vente,9800,,,PRES BUREAU OUEST,B117,16480,16040,Berneuil,16,,,16040000ZR0161,,,,,,,,,,,,,0,,,,,T,terres,,,9559,-0.075228,45.396521
2021-231034,2021-07-15,000001,Vente,240000,,,PRES BUREAU,B115,16480,16040,Berneuil,16,,,160400000C0240,,,,,,,,,,,,,0,,,,,J,jardins,,,1035,-0.074083,45.394735
2021-231034,2021-07-15,000001,Vente,240000,40,,RTE DE CHALLIGNAC,0200,16480,16040,Berneuil,16,,,160400000C0241,,,,,,,,,,,,,0,3,Dépendance,,0,S,sols,,,1502,-0.074243,45.394528
2021-231034,2021-07-15,000001,Vente,240000,40,,RTE DE CHALLIGNAC,0200,16480,16040,Berneuil,16,,,160400000C0241,,,,,,,,,,,,,0,1,Maison,220,6,S,sols,,,1502,-0.074243,45.394528
2021-231034,2021-07-15,000001,Vente,240000,40,,RTE DE CHALLIGNAC,0200,16480,16040,Berneuil,16,,,160400000C0241,,,,,,,,,,,,,0,3,Dépendance,,0,S,sols,,,1502,-0.074243,45.394528
2021-233268,2021-09-10,000001,Vente,240000,,,LE MAINE DU BOIS,B086,16480,16040,Berneuil,16,,,16040000ZM0068,,,,,,,,,,,,,0,,,,,S,sols,,,1286,-0.075375,45.386547
2021-233268,2021-09-10,000001,Vente,240000,,,LE MAINE DU BOIS,B086,16480,16040,Berneuil,16,,,16040000ZM0068,,,,,,,,,,,,,0,,,,,P,prés,,,3228,-0.075375,45.386547
2021-233268,2021-09-10,000001,Vente,240000,868,,RTE DE CHILLAC,0480,16480,16040,Berneuil,16,,,16040000ZM0069,,,,,,,,,,,,,0,3,Dépendance,,0,S,sols,,,1413,-0.075271,45.386608
2021-233268,2021-09-10,000001,Vente,240000,868,,RTE DE CHILLAC,0480,16480,16040,Berneuil,16,,,16040000ZM0069,,,,,,,,,,,,,0,3,Dépendance,,0,S,sols,,,1413,-0.075271,45.386608
2021-233268,2021-09-10,000001,Vente,240000,868,,RTE DE CHILLAC,0480,16480,16040,Berneuil,16,,,16040000ZM0069,,,,,,,,,,,,,0,3,Dépendance,,0,S,sols,,,1413,-0.075271,45.386608
2021-233268,2021-09-10,000001,Vente,240000,868,,RTE DE CHILLAC,0480,16480,16040,Berneuil,16,,,16040000ZM0069,,,,,,,,,,,,,0,1,Maison,154,5,S,sols,,,1413,-0.075271,45.386608
2021-233268,2021-09-10,000001,Vente,240000,868,,RTE DE CHILLAC,0480,16480,16040,Berneuil,16,,,16040000ZM0069,,,,,,,,,,,,,0,1,Maison,161,4,S,sols,,,1413,-0.075271,45.386608
2021-233268,2021-09-10,000001,Vente,240000,868,,RTE DE CHILLAC,0480,16480,16040,Berneuil,16,,,16040000ZM0069,,,,,,,,,,,,,0,1,Maison,114,4,S,sols,,,1413,-0.075271,45.386608
2021-233268,2021-09-10,000001,Vente,240000,868,,RTE DE CHILLAC,0480,16480,16040,Berneuil,16,,,16040000ZM0069,,,,,,,,,,,,,0,3,Dépendance,,0,S,sols,,,1413,-0.075271,45.386608
2021-233268,2021-09-10,000001,Vente,240000,868,,RTE DE CHILLAC,0480,16480,16040,Berneuil,16,,,16040000ZM0069,,,,,,,,,,,,,0,3,Dépendance,,0,S,sols,,,1413,-0.075271,45.386608
2021-233268,2021-09-10,000001,Vente,240000,868,,RTE DE CHILLAC,0480,16480,16040,Berneuil,16,,,16040000ZM0069,,,,,,,,,,,,,0,1,Maison,119,3,S,sols,,,1413,-0.075271,45.386608
2021-233268,2021-09-10,000001,Vente,240000,,,LE MAINE DU BOIS,B086,16480,16040,Berneuil,16,,,16040000ZM0070,,,,,,,,,,,,,0,,,,,T,terres,,,43,-0.075632,45.386802
2021-233268,2021-09-10,000001,Vente,240000,,,LE MAINE DU BOIS,B086,16480,16040,Berneuil,16,,,16040000ZM0071,,,,,,,,,,,,,0,,,,,T,terres,,,20,-0.075746,45.386793
2021-233268,2021-09-10,000001,Vente,240000,,,LE MAINE DU BOIS,B086,16480,16040,Berneuil,16,,,16040000ZM0085,,,,,,,,,,,,,0,,,,,T,terres,,,4,-0.075952,45.38619
2021-234339,2021-10-12,000001,Vente,8000,,,PIECE DE GRANGE,B110,16480,16040,Berneuil,16,,,16040000ZN0012,,,,,,,,,,,,,0,,,,,T,terres,,,7720,-0.084491,45.388683
2021-236336,2021-11-29,000002,Echange,500,,,MOULIN DE GRANGE,B099,16480,16040,Berneuil,16,,,16040000ZM0203,,,,,,,,,,,,,0,,,,,T,terres,,,1944,-0.080574,45.388003
2021-236336,2021-11-29,000002,Echange,500,,,MOULIN DE GRANGE,B099,16480,16040,Berneuil,16,,,16040000ZM0204,,,,,,,,,,,,,0,,,,,T,terres,,,1,-0.081656,45.390057
2021-236336,2021-11-29,000003,Echange,500,,,LE CHAZEAU,B025,16480,16040,Berneuil,16,,,16040000ZM0196,,,,,,,,,,,,,0,,,,,T,terres,,,359,-0.081413,45.389306
2021-236336,2021-11-29,000003,Echange,500,,,LE CHAZEAU,B025,16480,16040,Berneuil,16,,,16040000ZM0200,,,,,,,,,,,,,0,,,,,T,terres,,,1207,-0.081284,45.388959
2021-236753,2021-12-28,000001,Vente,346000,,,CHAMPS VIGIER,B023,16480,16040,Berneuil,16,,,16040000ZK0075,,,,,,,,,,,,,0,,,,,S,sols,,,546,-0.065761,45.38526
2021-236753,2021-12-28,000001,Vente,346000,,,CHAMPS VIGIER,B023,16480,16040,Berneuil,16,,,16040000ZK0096,,,,,,,,,,,,,0,,,,,P,prés,,,470,-0.066228,45.38541
2021-236753,2021-12-28,000001,Vente,346000,860,,RTE DE CHATIGNAC,0260,16480,16040,Berneuil,16,,,16040000ZK0100,,,,,,,,,,,,,0,3,Dépendance,,0,S,sols,,,1950,-0.065948,45.385308
2021-236753,2021-12-28,000001,Vente,346000,860,,RTE DE CHATIGNAC,0260,16480,16040,Berneuil,16,,,16040000ZK0100,,,,,,,,,,,,,0,3,Dépendance,,0,S,sols,,,1950,-0.065948,45.385308
2021-236753,2021-12-28,000001,Vente,346000,860,,RTE DE CHATIGNAC,0260,16480,16040,Berneuil,16,,,16040000ZK0100,,,,,,,,,,,,,0,1,Maison,190,4,S,sols,,,1950,-0.065948,45.385308
2021-236753,2021-12-28,000001,Vente,346000,,,CHAMPS VIGIER,B023,16480,16040,Berneuil,16,,,16040000ZK0130,,,,,,,,,,,,,0,,,,,P,prés,,,1615,-0.066057,45.384924
2021-236753,2021-12-28,000001,Vente,346000,,,CHAMPS VIGIER,B023,16480,16040,Berneuil,16,,,16040000ZK0133,,,,,,,,,,,,,0,,,,,T,terres,,,72,-0.066298,45.385461
2021-236758,2021-12-28,000002,Echange,500,,,CHAMPS VIGIER,B023,16480,16040,Berneuil,16,,,16040000ZK0133,,,,,,,,,,,,,0,,,,,T,terres,,,72,-0.066298,45.385461
2021-236758,2021-12-28,000003,Echange,500,,,CHAMPS VIGIER,B023,16480,16040,Berneuil,16,,,16040000ZK0129,,,,,,,,,,,,,0,,,,,P,prés,,,1795,-0.066272,45.38444
