id_mutation,date_mutation,numero_disposition,nature_mutation,valeur_fonciere,adresse_numero,adresse_suffixe,adresse_nom_voie,adresse_code_voie,code_postal,code_commune,nom_commune,code_departement,ancien_code_commune,ancien_nom_commune,id_parcelle,ancien_id_parcelle,numero_volume,lot1_numero,lot1_surface_carrez,lot2_numero,lot2_surface_carrez,lot3_numero,lot3_surface_carrez,lot4_numero,lot4_surface_carrez,lot5_numero,lot5_surface_carrez,nombre_lots,code_type_local,type_local,surface_reelle_bati,nombre_pieces_principales,code_nature_culture,nature_culture,code_nature_culture_speciale,nature_culture_speciale,surface_terrain,longitude,latitude
2021-225190,2021-01-11,000001,Vente,80000,5059,,MONS COLAS,B054,16250,16041,Bessac,16,,,160410000B0876,,,,,,,,,,,,,0,1,Maison,92,4,S,sols,,,735,-0.016878,45.411029
2021-229686,2021-05-28,000001,Vente,2197.2,,,BOIS DES VOUTES,B007,16250,16041,Bessac,16,,,160410000B0399,,,,,,,,,,,,,0,,,,,BT,taillis simples,,,2240,-0.020649,45.425681
2021-229686,2021-05-28,000001,Vente,2197.2,,,BOIS DES VOUTES,B007,16250,16041,Bessac,16,,,160410000B0409,,,,,,,,,,,,,0,,,,,BT,taillis simples,,,1140,-0.022148,45.426023
2021-229686,2021-05-28,000001,Vente,2197.2,,,BOIS DES VOUTES,B007,16250,16041,Bessac,16,,,160410000B0416,,,,,,,,,,,,,0,,,,,BT,taillis simples,,,3770,-0.023804,45.424953
2021-234221,2021-10-21,000001,Vente,270000,,,LE BOIS,B003,16250,16041,Bessac,16,,,160410000A0423,,,,,,,,,,,,,0,,,,,J,jardins,,,850,-0.007826,45.431212
2021-234221,2021-10-21,000001,Vente,270000,,,LE BOIS,B003,16250,16041,Bessac,16,,,160410000A1008,,,,,,,,,,,,,0,,,,,S,sols,,,231,-0.008585,45.431633
2021-234221,2021-10-21,000001,Vente,270000,5013,,LE BOIS,B003,16250,16041,Bessac,16,,,160410000A1010,,,,,,,,,,,,,0,1,Maison,120,8,S,sols,,,1748,-0.00799,45.431284
2021-234221,2021-10-21,000001,Vente,270000,,,LE BOIS,B003,16250,16041,Bessac,16,,,160410000A1011,,,,,,,,,,,,,0,,,,,T,terres,,,507,-0.007996,45.431234
2021-234221,2021-10-21,000001,Vente,270000,,,LE BOIS,B003,16250,16041,Bessac,16,,,160410000A1012,,,,,,,,,,,,,0,,,,,T,terres,,,74,-0.008644,45.431662
